{"text_format":"1","workbook":"xlsx","n_sheets":16,"sheets":["Control","Change Log","Order Form","Dynamics GP","Localization Disclaimer","Dynamics CRM","GP Master Calc","Extract","GP FuseBox","GP Product Data","GP Availability","Geography","CRM FuseBox","CRM Master Calc","CRM Product Data","CRM Availability"],"not_rendered":{"charts":0,"images":16,"macros":1,"external_links":1,"defined_names":84,"comments":2,"pivot_tables":0},"unopened":[],"bounds":{"document_bytes":16777216,"sheet_cells":100000,"rows_first":2000,"rows_last":500,"rows_between":2000,"halvings":0,"cell_chars":16384,"cell_head_chars":4096},"cells_cut":0,"cells_raw":0,"read":"whole","date_system":"1900"}

{"sheet":"Control","index":0,"n_rows":6,"n_cols":6,"rows_kept":6,"cut":false,"hidden":true,"merged":[]}
[null,null,null,null,null,"Version2.b"]
[]
[]
[]
[null,null,null,"PriceList Month",null,"April"]
[null,null,null,"Pricelist Year (YYYY)",null,2013]

{"sheet":"Change Log","index":1,"n_rows":9,"n_cols":9,"rows_kept":9,"cut":false,"hidden":false,"merged":[[3,1,3,8],[4,1,4,8]]}
[]
[]
[]
[null,"Microsoft Dynamics® GP Price List Change Log"]
[null,{"$f":"'GP Master Calc'!E5","v":"Price List – Effective April, 2013"}]
[null,"Date","Affected Countries ","ROC","Type of Change","Edition","Summary of Change","SKU","Additional Resource"]
[null,"2013-01-01","Worldwide","All","Price Change","All","Price changed on Microsoft® SQL Server® 2008 R2  Standard & Enterprise Edition Runtime Server License (English) and Microsoft® SQL Server ® 2008 R2  Standard & Enterprise Edition Runtime CAL (English). Please refer to PartnerSource for further information.","109100717, 109100709, 109100703, 109100716\n"]
[null,"2013-01-01","India","APOC","Removal","All","SQL removed for India. Please refer to PartnerSource announcements for further information."]
[null,"2013-01-01","India","APOC","Price","All","10% price increase for India. Please refer to PartnerSource announcements for further information."]

{"sheet":"Order Form","index":2,"n_rows":254,"n_cols":117,"rows_kept":254,"cut":false,"hidden":false,"merged":[[211,114,211,115],[212,87,212,89],[19,1,20,7],[13,1,13,7],[23,1,23,7],[30,4,30,5],[31,4,31,5],[44,2,44,4],[51,3,52,7],[54,1,54,3],[58,1,60,7],[61,1,62,5],[212,72,212,74],[212,75,212,77],[212,78,212,80],[212,81,212,83],[1,1,1,7],[3,1,10,1],[21,1,22,7],[12,1,12,7],[212,69,212,71],[212,84,212,86],[211,69,211,74],[61,6,62,6],[61,7,62,7],[63,1,64,5],[63,6,64,6],[63,7,64,7],[65,1,65,5],[66,1,66,5],[67,1,67,7],[77,1,82,7]]}
[null,null,null,null,null,null,null,null,null,null,null,null,null,null,null,null,null,null,null,null,null,null,null,null,null,null,null,null,null,null,null,null,null,null,null,"Selected  Language Code",null,1,0,null,null,"ORDERTYPETRANS",null,null,null,null,"ENHANCEMENTPLANTRANS",null,null,null,null,"NACECODETRANS",null,null,null,null,"UPGRADETRANS"]
[null,"Microsoft Dynamics Global Order Form",null,null,null,null,null,null,null,null,null,null,null,null,null,null,null,null,null,null,null,null,null,null,"NACECODE",null,"ENHANCEMENTPLAN",null,"PRODUCT-ALL",null,"COUNTRY",null,"EEASCOUNTRY",null,1,"English","Deutsch (German)","Japanese","Notes",1,"English","Deutsch (German)","Japanese","Notes",1,"English","Deutsch (German)","Japanese","Notes",1,"English","Deutsch (German)","Japanese","Notes",1,"English","Deutsch (German)","Japanese","Notes"]
[null,null,null,null,null,null,null,null,null,null,null,null,null,null,null,null,null,null,null,null,null,null,null,null,{"$f":"INDEX(NACECODETRANS[],$AX2,OFSELECETEDLANGUAGECODE,1)","v":"1 - Agriculture, hunting, etc.                                           "},null,{"$f":"INDEX(ENHANCEMENTPLANTRANS[],$AS2,OFSELECETEDLANGUAGECODE,1)","v":"1 Year"},null,"All",null,"Afghanistan",null,"Andorra",null,2,"EOC – Europe, Middle East & Africa","EOC –  Information zur Bestellerfassung – Europa, Naher Osten & Afrika",null,null,2,"None Selected","None Selected","None Selected",null,2,"1 Year","1 Year","1年間プラン",null,2,"1 - Agriculture, hunting, etc.                                           ","1 - Agriculture, hunting, etc.                                           ","該当するものを選択してください",null,2,"Formula Based Upgrade/Transition","Formula Based Upgrade/Transition","計算式ベースの製品バージョンのアップグレード/移行"]
[null,{"$f":"INDEX(ORDERFORMTRANSTABLE[],$AI78,OFSELECETEDLANGUAGECODE,1)","v":"Submission Details:"},{"$f":"INDEX(ORDERFORMTRANSTABLE[],$AI2,OFSELECETEDLANGUAGECODE,1)","v":"EOC – Europe, Middle East & Africa"},null,null,null,"Form Version 7-5W",null,null,null,null,null,null,null,null,null,null,null,null,null,null,null,null,null,{"$f":"INDEX(NACECODETRANS[],$AX3,OFSELECETEDLANGUAGECODE,1)","v":"2 - Forestry, etc.                                                       "},null,{"$f":"INDEX(ENHANCEMENTPLANTRANS[],$AS3,OFSELECETEDLANGUAGECODE,1)","v":"3 Years: Annually"},null,"Microsoft Dynamics AX 2012",null,"Albania",null,"Austria",null,3,"AOC – North America, Canada and LATAM region","AOC – Information zur Bestellerfassung –  Nordamerika, Kanada und LATAM-Region",null,null,3,"New License","New License","New License",null,3,"3 Years: Annually","3 Years: Annually","3年間プラン: 年次",null,3,"2 - Forestry, etc.                                                       ","2 - Forestry, etc.                                                       ","10000  農業",null,3,"Credit Based Upgrade/Transition","Credit Based Upgrade/Transition","クレジット ベースの製品バージョンのアップグレード/移行"]
[null,null,{"$f":"INDEX(ORDERFORMTRANSTABLE[],$AI82,OFSELECETEDLANGUAGECODE,1)","v":"MIMOS Operations Support Request"},null,null,null,null,null,null,null,null,null,null,null,null,null,null,null,null,null,null,null,null,null,{"$f":"INDEX(NACECODETRANS[],$AX4,OFSELECETEDLANGUAGECODE,1)","v":"5 - Fishing, etc.                                                        "},null,{"$f":"INDEX(ENHANCEMENTPLANTRANS[],$AS4,OFSELECETEDLANGUAGECODE,1)","v":"3 Years: Upfront"},null,"Microsoft Dynamics NAV",null,"Algeria",null,"Belgium",null,4,"APOC – Asia-Pacific Region","APOC – Information zur Bestellerfassung – Asien-Pazifik-Region","APOC - 日本を含むアジア・太平洋地域 - オーダーに関するお問い合わせ先 -",null,4,"Additional Product","Additional Product","Additional Product",null,4,"3 Years: Upfront","3 Years: Upfront","3年間プラン: 一括",null,4,"5 - Fishing, etc.                                                        ","5 - Fishing, etc.                                                        ","20000  森林業"]
[null,null,null,null,null,null,null,null,null,null,null,null,null,null,null,null,null,null,null,null,null,null,null,null,{"$f":"INDEX(NACECODETRANS[],$AX5,OFSELECETEDLANGUAGECODE,1)","v":"10 - Coalmines, lignite leasings and peat bog excavation                  "},null,null,null,"Microsoft Dynamics NAV Perpetual",null,"American Samoa",null,"Bouvet Island",null,5,"AOC PARTNERS PLEASE NOTE: ","HINWEIS FÜR AOC-PARTNER:",null,null,5,"Enhancement Renewal/Re-Enrolment","Enhancement Renewal/Re-Enrolment","Enhancement Renewal/Re-Enrolment",null,null,null,null,null,null,5,"10 - Coalmines, lignite leasings and peat bog excavation                  ","10 - Coalmines, lignite leasings and peat bog excavation                  ","50000  漁業"]
[null,null,{"$f":"INDEX(ORDERFORMTRANSTABLE[],$AI3,OFSELECETEDLANGUAGECODE,1)","v":"AOC – North America, Canada and LATAM region"},null,null,null,null,null,null,null,null,null,null,null,null,null,null,null,null,null,null,null,null,null,{"$f":"INDEX(NACECODETRANS[],$AX6,OFSELECETEDLANGUAGECODE,1)","v":"11 - Crude oil and natural gas extraction                                 "},null,null,null,"Microsoft Dynamics AX",null,"Andorra",null,"Bulgaria",null,6,"In order to ensure the fastest order processing, the following completed Order Form is now required for all eligible manual orders in AOC. ","Um eine schnellstmögliche Bearbeitung Ihrer Bestellung zu gewährleisten, ist künftig dieses vollständig ausgefüllte Bestellformular für alle entsprechenden manuellen Bestellungen in AOC erforderlich.",null,null,6,"Transition","Transition","Transition",null,null,null,null,null,null,6,"11 - Crude oil and natural gas extraction                                 ","11 - Crude oil and natural gas extraction                                 ","100000  石炭製品製造業",null,null,"NAVUPGRADE"]
[null,null,{"$f":"INDEX(ORDERFORMTRANSTABLE[],$AI83,OFSELECETEDLANGUAGECODE,1)","v":"mbsquery@microsoft.com"},null,null,null,null,null,null,null,null,null,null,null,null,null,null,null,null,null,null,null,null,null,{"$f":"INDEX(NACECODETRANS[],$AX7,OFSELECETEDLANGUAGECODE,1)","v":"12 - Uranium ore and thorium ore quarrying                                "},null,null,null,"Microsoft Dynamics GP",null,"Angola",null,"Croatia",null,7,"1.  Orders received on out-of-date pricelists will not be processed and will be returned to the sender for correction.","1.  Bestellungen, die anhand von veralteten Preislisten erstellt wurden, werden nicht angenommen. Der Absender erhält sie zur Korrektur zurück.","1.  期限切れのプライスリストによって提出されたオーダーは処理されません。送り先へ修正のため返送されるのでご了承ください。",null,7,"Additional Product + Enhancement Renewal","Additional Product + Enhancement Renewal","Additional Product + Enhancement Renewal",null,null,null,null,null,null,7,"12 - Uranium ore and thorium ore quarrying                                ","12 - Uranium ore and thorium ore quarrying                                ","110000  原油・天然ガス鉱業",null,1,"English","Deutsch (German)","Japanese","Notes"]
[null,null,null,null,null,null,null,null,null,null,null,null,null,null,null,null,null,null,null,null,null,null,null,null,{"$f":"INDEX(NACECODETRANS[],$AX8,OFSELECETEDLANGUAGECODE,1)","v":"13 - Quarrying of metalliferous ore                                       "},null,null,null,"Microsoft Dynamics GP Perpetual",null,"Anguilla",null,"Cyprus",null,8,"2.  Underlined fields are mandatory.","2.  Felder mit erforderlichen Angaben sind unterstrichen dargestellt.","2.  アンダーラインの箇所(_) は必須項目です。必ずご記入ください。ピンクの箇所は日英併記をお願いいたします。",null,8,"Step Up","Step Up","Step Up",null,null,null,null,null,null,8,"13 - Quarrying of metalliferous ore                                       ","13 - Quarrying of metalliferous ore                                       ","130000  金属鉱業",null,2,"License migration transition/upgrade’","Formula Based Upgrade/Transition","計算式ベースの製品バージョンのアップグレード/移行"]
[null,null,{"$f":"INDEX(ORDERFORMTRANSTABLE[],$AI4,OFSELECETEDLANGUAGECODE,1)","v":"APOC – Asia-Pacific Region"},null,null,null,null,null,null,null,null,null,null,null,null,null,null,null,null,null,null,null,null,null,{"$f":"INDEX(NACECODETRANS[],$AX9,OFSELECETEDLANGUAGECODE,1)","v":"14 - Extraction of raw material in general                                "},null,null,null,"Microsoft Dynamics SL",null,"Antarctica",null,"Czech Republic",null,9,"3.  Alterations to the format of this coversheet may result in delays or non-acceptance.","3.  Änderungen am Layout dieses Bestellformulars führen ggf. zu Verzögerungen oder zur Ablehnung der Bestellung.","3.  このオーダーフォーム以外でオーダーした場合、承認が遅れたり、オーダーを受け付けられなかったりする可能性があります。",null,9,"Additional Product + Step Up","Additional Product + Step Up","Additional Product + Step Up",null,null,null,null,null,null,9,"14 - Extraction of raw material in general                                ","14 - Extraction of raw material in general                                ","140000  原料製造業一般",null,3,"Credit Based Upgrade/Transition","Credit Based Upgrade/Transition","クレジット ベースの製品バージョンのアップグレード/移行"]
[null,null,{"$f":"INDEX(ORDERFORMTRANSTABLE[],$AI81,OFSELECETEDLANGUAGECODE,1)","v":"MIMOS Call Logging Tool"},{"$f":"INDEX(ORDERFORMTRANSTABLE[],$AI79,OFSELECETEDLANGUAGECODE,1)","v":"Where CLT is not available, please use:"},null,"mbsquery@microsoft.com",null,null,null,null,null,null,null,null,null,null,null,null,null,null,null,null,null,null,{"$f":"INDEX(NACECODETRANS[],$AX10,OFSELECETEDLANGUAGECODE,1)","v":"15 - Food and beverage production                                         "},null,null,null,"Microsoft Dynamics CRM",null,"Antigua and Barbuda",null,"Denmark",null,10,"4.  To submit the order, please follow the standard process for your respective Regional Operations Center.","4.  Um die Bestellung aufzugeben, befolgen Sie bitte den Standardprozess Ihres zuständigen Regional Operations Centers.","4.  オーダー提出方法に関しては地域オペレーションセンターより指示されている方法に従ってください。",null,null,null,null,null,null,null,null,null,null,null,10,"15 - Food and beverage production                                         ","15 - Food and beverage production                                         ","150000  食料品・飲料製造業"]
[null,null,null,null,null,null,null,null,null,null,null,null,null,null,null,null,null,null,null,null,null,null,null,null,{"$f":"INDEX(NACECODETRANS[],$AX11,OFSELECETEDLANGUAGECODE,1)","v":"16 - Tobacco factories                                                    "},null,null,null,"Microsoft Dynamics RMS",null,"Argentina",null,"Estonia",null,11,"5.  In the Order Type dropdown, please select 'Additional Product+Enhancement Renewal' only when you want to buy a brand new Enhancement Plan and some additional modules.","5.  Wählen Sie im Feld \"Art der Bestellung\" aus der Drop-down-Liste bitte nur dann 'Zusätzliches Produkt + Verlängerung Enhancement' aus, wenn Sie einen neuen Enhancement Plan und einige zusätzliche Module kaufen möchten.","5. 注文書上「オーダータイプ」のプルダウンメニューにある、追加ライセンス+エンハンスメントプラン更新 (Additional Product+Enhancement Renewal)は、新規エンハンスメントプランと追加ライセンスを同時に購入する場合に使用します。",null,null,null,null,null,null,null,null,null,null,null,11,"16 - Tobacco factories                                                    ","16 - Tobacco factories                                                    ","160000  たばこ製造業"]
[null,{"$f":"INDEX(ORDERFORMTRANSTABLE[],$AI5,OFSELECETEDLANGUAGECODE,1)","v":"AOC PARTNERS PLEASE NOTE: "},null,null,null,null,null,null,null,null,null,null,null,null,null,null,null,null,null,null,null,null,null,null,{"$f":"INDEX(NACECODETRANS[],$AX12,OFSELECETEDLANGUAGECODE,1)","v":"17 - Textile industry                                                     "},null,"AGREEMENT",null,"Microsoft Dynamics C5",null,"Armenia",null,"Faroe Islands",null,12,"6.  This order may not be processed if your account has overdue balances or you have exceeded your credit limit. To check your account statement and credit limit please go to https://mbs.microsoft.com/voice and check your account information in Scorecard-Balance info.","6.  Bitte beachten Sie, dass diese Bestellung nur dann bearbeitet wird, wenn Ihr Konto keine überfälligen offenen Zahlungen aufweist und Sie Ihr Kreditlimit noch nicht ausgeschöpft haben. Ihren aktuellen Kontoauszug und Ihr Kreditlimit können Sie auf https://mbs.microsoft.com/voice einsehen, indem Sie Ihre Kontodaten in der Scorecard-Balance-Info überprüfen.","6. アカウントに支払遅延分があり、また、与信限度額を超えていた場合、オーダーは処理されません。https://mbs.microsoft.com/voiceの Scorecard - バランスインフォメーションにて、取引詳細と与信限度額をご確認ください。",null,null,null,null,null,null,null,null,null,null,null,12,"17 - Textile industry                                                     ","17 - Textile industry                                                     ","170000  繊維工業"]
[null,{"$f":"INDEX(ORDERFORMTRANSTABLE[],$AI6,OFSELECETEDLANGUAGECODE,1)","v":"In order to ensure the fastest order processing, the following completed Order Form is now required for all eligible manual orders in AOC. "},null,null,null,null,null,null,null,null,null,null,null,null,null,null,null,null,null,null,null,null,null,null,{"$f":"INDEX(NACECODETRANS[],$AX13,OFSELECETEDLANGUAGECODE,1)","v":"18 - Footware and clothing industry                                       "},null,"No",null,"Microsoft Dynamics NAV MBL",null,"Aruba",null,"Finland",null,13,"Order Details:","Angaben zur Bestellung:","オーダー詳細",null,null,null,null,null,null,null,null,null,null,null,13,"18 - Footware and clothing industry                                       ","18 - Footware and clothing industry                                       ","180000  履物＆衣服製造業"]
[null,null,null,null,null,null,null,null,null,null,null,null,null,null,null,null,null,null,null,null,null,null,null,null,{"$f":"INDEX(NACECODETRANS[],$AX14,OFSELECETEDLANGUAGECODE,1)","v":"19 - Leather industry                                                     "},null,"Global Volume Agreement",null,"Microsoft Dynamics AX MBL",null,"Australia",null,"France",null,14,"Order Date: ","Bestelldatum:","オーダー日",null,null,null,null,null,null,null,null,null,null,null,14,"19 - Leather industry                                                     ","19 - Leather industry                                                     ","190000  革製品製造業"]
[null,{"$f":"INDEX(ORDERFORMTRANSTABLE[],$AI7,OFSELECETEDLANGUAGECODE,1)","v":"1.  Orders received on out-of-date pricelists will not be processed and will be returned to the sender for correction."},null,null,null,null,null,null,null,null,null,null,null,null,null,null,null,null,null,null,null,null,null,null,{"$f":"INDEX(NACECODETRANS[],$AX15,OFSELECETEDLANGUAGECODE,1)","v":"20 - Lumber industry                                                      "},null,"MultiSite Agreement",null,"Microsoft Dynamics GP MBL",null,"Austria",null,"French Guiana",null,15,"Purchase Order (PO) number: ","Bestellnr. bzw.  Purchase Order (PO) No.:","内部注文書番号",null,null,null,null,null,null,null,null,null,null,null,15,"20 - Lumber industry                                                      ","20 - Lumber industry                                                      ","200000  製材業"]
[null,{"$f":"INDEX(ORDERFORMTRANSTABLE[],$AI8,OFSELECETEDLANGUAGECODE,1)","v":"2.  Underlined fields are mandatory."},null,null,null,null,null,null,null,null,null,null,null,null,null,null,null,null,null,null,null,null,null,null,{"$f":"INDEX(NACECODETRANS[],$AX16,OFSELECETEDLANGUAGECODE,1)","v":"21 - Paper industry                                                       "},null,"Volume Purchase Option",null,"Microsoft Dynamics SL MBL",null,"Azerbaijan",null,"French Southern and Antarctic Lands",null,16,"Media Required: ","Medien erforderlich ","メディア",null,null,null,null,null,null,null,null,null,null,null,16,"21 - Paper industry                                                       ","21 - Paper industry                                                       ","220000  グラフィック業"]
[null,{"$f":"INDEX(ORDERFORMTRANSTABLE[],$AI9,OFSELECETEDLANGUAGECODE,1)","v":"3.  Alterations to the format of this coversheet may result in delays or non-acceptance."},null,null,null,null,null,null,null,null,null,null,null,null,null,null,null,null,null,null,null,null,null,null,{"$f":"INDEX(NACECODETRANS[],$AX17,OFSELECETEDLANGUAGECODE,1)","v":"22 - Graphic industry                                                     "},null,null,null,"Microsoft Dynamics C5 Light",null,"Bahamas, The",null,"Germany",null,17,"Deal/Promoweb Value:","Deal-/Promoweb-Wert","特別割引",null,null,null,null,null,null,null,null,null,null,null,17,"22 - Graphic industry                                                     ","22 - Graphic industry                                                     ","230000  鉱物油製造業"]
[null,{"$f":"INDEX(ORDERFORMTRANSTABLE[],$AI10,OFSELECETEDLANGUAGECODE,1)","v":"4.  To submit the order, please follow the standard process for your respective Regional Operations Center."},null,null,null,null,null,null,null,null,null,null,null,null,null,null,null,null,null,null,null,null,null,null,{"$f":"INDEX(NACECODETRANS[],$AX18,OFSELECETEDLANGUAGECODE,1)","v":"23 - Mineral oil industry, etc.                                           "},null,null,null,null,null,"Bahrain",null,"Gibraltar",null,18,"For SQL/MOSS Media Pricelist Click Here","For SQL/MOSS Media Pricelist Click Here","SQL/MOSS Mediaの価格表はこちらから",null,null,null,null,null,null,null,null,null,null,null,18,"23 - Mineral oil industry, etc.                                           ","23 - Mineral oil industry, etc.                                           ","240000  化学工業"]
[null,{"$f":"INDEX(ORDERFORMTRANSTABLE[],$AI11,OFSELECETEDLANGUAGECODE,1)","v":"5.  In the Order Type dropdown, please select 'Additional Product+Enhancement Renewal' only when you want to buy a brand new Enhancement Plan and some additional modules."},null,null,null,null,null,null,null,null,null,null,null,null,null,null,null,null,null,null,null,null,null,null,{"$f":"INDEX(NACECODETRANS[],$AX19,OFSELECETEDLANGUAGECODE,1)","v":"24 - Chemical industry                                                    "},null,null,null,{"$f":"IF(AC22<>FALSE,AC22,IF(AC23<>FALSE,AC23,IF(AC27<>FALSE,AC27,IF(AND(AC24<>FALSE,AC25<>FALSE,AC26<>FALSE),\"License Model Transisiton\",\"Product Line Transistion\"))))","v":"Product Line Transistion"},null,"Bangladesh",null,"Greece",null,19,"For any other media please attach the media Pricelist","Andere Medien: Bitte ausgefüllte Medien-Preisliste beifügen.","その他のメディアについては、メディア価格表をご使用ください。",null,null,null,null,null,null,null,null,null,null,null,19,"24 - Chemical industry                                                    ","24 - Chemical industry                                                    ","250000  ゴム製品・プラスチック製品製造業"]
[null,null,null,null,null,null,null,null,null,null,null,null,null,null,null,null,null,null,null,null,null,null,null,null,{"$f":"INDEX(NACECODETRANS[],$AX20,OFSELECETEDLANGUAGECODE,1)","v":"25 - Rubber and plastics industries                                       "},null,null,null,null,null,"Barbados",null,"Greenland",null,20,"Ship                        Contact Name:  ","Lieferanschrift      Empfänger:","出荷先                名前",null,null,null,null,null,null,null,null,null,null,null,20,"25 - Rubber and plastics industries                                       ","25 - Rubber and plastics industries                                       ","260000  石工品、陶磁器・ガラス製品製造業"]
[null,{"$f":"INDEX(ORDERFORMTRANSTABLE[],$AI12,OFSELECETEDLANGUAGECODE,1)","v":"6.  This order may not be processed if your account has overdue balances or you have exceeded your credit limit. To check your account statement and credit limit please go to https://mbs.microsoft.com/voice and check your account information in Scorecard-Balance info."},null,null,null,null,null,null,null,null,null,null,null,null,null,null,null,null,null,null,null,null,null,null,{"$f":"INDEX(NACECODETRANS[],$AX21,OFSELECETEDLANGUAGECODE,1)","v":"26 - Stone-working, pottery and glass industries, etc.                    "},null,null,null,{"$f":"IF(C50=C51,\"Edition Transition\")","v":false},null,"Belarus",null,"Guadeloupe",null,21,"To                                 Address 1: ","Adresse 1:","住所1",null,null,null,null,null,null,null,null,null,null,null,21,"26 - Stone-working, pottery and glass industries, etc.                    ","26 - Stone-working, pottery and glass industries, etc.                    ","270000  金属鉱業"]
[null,null,null,null,null,null,null,null,null,null,null,null,null,null,null,null,null,null,null,null,null,null,null,null,{"$f":"INDEX(NACECODETRANS[],$AX22,OFSELECETEDLANGUAGECODE,1)","v":"27 - Metal production                                                     "},null,null,null,{"$f":"IFERROR(IF(AND(FIND(\"AX\",C50),FIND(\"AX 2012\",C51)),\"Upgrade Transistion\"),FALSE)","v":false},null,"Belgium",null,"Hungary",null,22,"Details                  Address 2/State: ","Adresse 2/US-Staat:","住所2",null,null,null,null,null,null,null,null,null,null,null,22,"27 - Metal production                                                     ","27 - Metal production                                                     ","280000  鉄金属製品製造業"]
[null,{"$f":"INDEX(ORDERFORMTRANSTABLE[],$AI74,OFSELECETEDLANGUAGECODE,1)","v":0},null,null,null,null,null,null,null,null,null,null,null,null,null,null,null,null,null,null,null,null,null,null,{"$f":"INDEX(NACECODETRANS[],$AX23,OFSELECETEDLANGUAGECODE,1)","v":"28 - Iron and metal goods industry                                        "},null,"ORDERTYPE",null,{"$f":"(LEFT(C50,21)=LEFT(C51,21))","v":false},null,"Belize",null,"Iceland",null,23,"City: ","Ort:","都道府県・市",null,null,null,null,null,null,null,null,null,null,null,23,"28 - Iron and metal goods industry                                        ","28 - Iron and metal goods industry                                        ","290000  機械工業"]
[null,{"$f":"INDEX(ORDERFORMTRANSTABLE[],$AI13,OFSELECETEDLANGUAGECODE,1)","v":"Order Details:"},null,null,null,null,null,null,null,null,null,null,null,null,null,null,null,null,null,null,null,null,null,null,{"$f":"INDEX(NACECODETRANS[],$AX24,OFSELECETEDLANGUAGECODE,1)","v":"29 - Mechanical engineering industry                                      "},null,{"$f":"INDEX(ORDERTYPETRANS[],$AN2,OFSELECETEDLANGUAGECODE,1)","v":"None Selected"},null,{"$f":"IFERROR(FIND(\"MBL\",C50),FALSE)","v":false},null,"Benin",null,"Ireland, Republic of",null,24,"Postal Code/ZIP: ","PLZ/ZIP:","郵便番号",null,null,null,null,null,null,null,null,null,null,null,24,"29 - Mechanical engineering industry                                      ","29 - Mechanical engineering industry                                      ","300000  事務用機械・コンピューター機械器具製造業"]
[null,null,null,null,null,1,null,null,null,null,null,null,null,null,null,null,null,null,null,null,null,null,null,null,{"$f":"INDEX(NACECODETRANS[],$AX25,OFSELECETEDLANGUAGECODE,1)","v":"30 - Production of office machinery and computer equipment                "},null,{"$f":"INDEX(ORDERTYPETRANS[],$AN3,OFSELECETEDLANGUAGECODE,1)","v":"New License"},null,{"$f":"IFERROR(FIND(\"AX 2012\",C51),TRUE)","v":true},null,"Bermuda",null,"Italy",null,25,"Country: ","Land:","国",null,null,null,null,null,null,null,null,null,null,null,25,"30 - Production of office machinery and computer equipment                ","30 - Production of office machinery and computer equipment                ","310000  その他の電子機械器具製造業"]
[null,{"$f":"INDEX(ORDERFORMTRANSTABLE[],$AI14,OFSELECETEDLANGUAGECODE,1)","v":"Order Date: "},null,null,{"$f":"INDEX(ORDERFORMTRANSTABLE[],$AI75,OFSELECETEDLANGUAGECODE,1)","v":"Special Deal / Promoweb: "},"No",null,null,null,null,null,null,null,null,null,null,null,null,null,null,null,null,null,null,{"$f":"INDEX(NACECODETRANS[],$AX26,OFSELECETEDLANGUAGECODE,1)","v":"31 - Production of other electrical machinery                             "},null,{"$f":"INDEX(ORDERTYPETRANS[],$AN4,OFSELECETEDLANGUAGECODE,1)","v":"Additional Product"},null,{"$f":"IFERROR(IF(AND(FIND(\"NAV\",C50),FIND(\"NAV Perpetual\",C51)),\"License Migration Transition or License Credit Transition\"),IFERROR(IF(AND(FIND(\"GP\",C50),FIND(\"GP Perpetual\",C51)),\"License Migration Transition or License Credit Transition\",FALSE),FALSE))","v":false},null,"Bhutan",null,"Latvia",null,26,"Partner Details:","Angaben zum Partner:","パートナー詳細",null,null,null,null,null,null,null,null,null,null,null,26,"31 - Production of other electrical machinery                             ","31 - Production of other electrical machinery                             ","320000  通信機械器具製造業"]
[null,{"$f":"INDEX(ORDERFORMTRANSTABLE[],$AI15,OFSELECETEDLANGUAGECODE,1)","v":"Purchase Order (PO) number: "},null,null,{"$f":"INDEX(ORDERFORMTRANSTABLE[],$AI76,OFSELECETEDLANGUAGECODE,1)","v":"Deal ID/Promoweb ID:"},null,null,null,null,null,null,null,null,null,null,null,null,null,null,null,null,null,null,null,{"$f":"INDEX(NACECODETRANS[],$AX27,OFSELECETEDLANGUAGECODE,1)","v":"32 - Production of transmission equipment                                 "},null,{"$f":"INDEX(ORDERTYPETRANS[],$AN5,OFSELECETEDLANGUAGECODE,1)","v":"Enhancement Renewal/Re-Enrolment"},null,null,null,"Bolivia",null,"Liechtenstein",null,27,"VOICE Account Number: ","VOICE Account Number:","VOICEアカウントナンバー",null,null,null,null,null,null,null,null,null,null,null,27,"32 - Production of transmission equipment                                 ","32 - Production of transmission equipment                                 ","330000  医療用機械器具・医療用品製造業"]
[null,"MA/GVA/VPO: ","No",null,{"$f":"INDEX(ORDERFORMTRANSTABLE[],$AI17,OFSELECETEDLANGUAGECODE,1)","v":"Deal/Promoweb Value:"},null,null,null,null,null,null,null,null,null,null,null,null,null,null,null,null,null,null,null,{"$f":"INDEX(NACECODETRANS[],$AX28,OFSELECETEDLANGUAGECODE,1)","v":"33 - Production of medical equipment,instruments,tools,clocks,etc.        "},null,{"$f":"INDEX(ORDERTYPETRANS[],$AN6,OFSELECETEDLANGUAGECODE,1)","v":"Transition"},null,"PRODUCT-DYN",null,"Bosnia and Herzegovina",null,"Lithuania",null,28,"Distributor Order: ","Distributorenbestellung","代理店 モデル(日本には適用されません):",null,null,null,null,null,null,null,null,null,null,null,28,"33 - Production of medical equipment,instruments,tools,clocks,etc.        ","33 - Production of medical equipment,instruments,tools,clocks,etc.        ","340000  自動車・同付属品製造業"]
[null,"Agreement number: ",null,null,{"$f":"IF($C$29=\"No\",\"\",INDEX(ORDERFORMTRANSTABLE[],$AI77,OFSELECETEDLANGUAGECODE,1))","v":""},null,null,null,null,null,null,null,null,null,null,null,null,null,null,null,null,null,null,null,{"$f":"INDEX(NACECODETRANS[],$AX29,OFSELECETEDLANGUAGECODE,1)","v":"34 - Automobile production, etc.                                          "},null,{"$f":"INDEX(ORDERTYPETRANS[],$AN7,OFSELECETEDLANGUAGECODE,1)","v":"Additional Product + Enhancement Renewal"},null,"All",null,"Botswana",null,"Luxembourg",null,29,"Partner Name (as per VOICE): ","Partnername (wie in VOICE):","パートナー名",null,null,null,null,null,null,null,null,null,null,null,29,"34 - Automobile production, etc.                                          ","34 - Automobile production, etc.                                          ","350000  その他の輸送用機械器具製造業"]
[null,{"$f":"INDEX(ORDERFORMTRANSTABLE[],$AI16,OFSELECETEDLANGUAGECODE,1)","v":"Media Required: "},"No",null,{"$f":"INDEX(ORDERFORMTRANSTABLE[],$AI18,OFSELECETEDLANGUAGECODE,1)","v":"For SQL/MOSS Media Pricelist Click Here"},{"$f":"INDEX(ORDERFORMTRANSTABLE[],$AI16,OFSELECETEDLANGUAGECODE,1)","v":"Media Required: "},null,null,null,null,null,null,null,null,null,null,null,null,null,null,null,null,null,null,{"$f":"INDEX(NACECODETRANS[],$AX30,OFSELECETEDLANGUAGECODE,1)","v":"35 - Production of other means of transport                               "},null,{"$f":"INDEX(ORDERTYPETRANS[],$AN8,OFSELECETEDLANGUAGECODE,1)","v":"Step Up"},null,"Microsoft Dynamics AX 2012",null,"Bouvet Island",null,"Malta",null,30,"Distributor Account Number:","Distrubutor Account Number","代理店 アカウント 番号",null,null,null,null,null,null,null,null,null,null,null,30,"35 - Production of other means of transport                               ","35 - Production of other means of transport                               ","360000  家具・装備品製造業"]
[null,null,null,null,{"$f":"INDEX(ORDERFORMTRANSTABLE[],$AI19,OFSELECETEDLANGUAGECODE,1)","v":"For any other media please attach the media Pricelist"},null,null,null,null,null,null,null,null,null,null,null,null,null,null,null,null,null,null,null,{"$f":"INDEX(NACECODETRANS[],$AX31,OFSELECETEDLANGUAGECODE,1)","v":"36 - Furniture industry and other manufacturing                           "},null,{"$f":"INDEX(ORDERTYPETRANS[],$AN9,OFSELECETEDLANGUAGECODE,1)","v":"Additional Product + Step Up"},null,"Microsoft Dynamics AX",null,"Brazil",null,"Martinique",null,31,"Distributor Name:","Distributorenname","代理店名",null,null,null,null,null,null,null,null,null,null,null,31,"36 - Furniture industry and other manufacturing                           ","36 - Furniture industry and other manufacturing                           ","370000  リサイクル業"]
[null,{"$f":"INDEX(ORDERFORMTRANSTABLE[],$AI20,OFSELECETEDLANGUAGECODE,1)","v":"Ship                        Contact Name:  "},null,null,{"$f":"INDEX(ORDERFORMTRANSTABLE[],$AI23,OFSELECETEDLANGUAGECODE,1)","v":"City: "},null,null,null,null,null,null,null,null,null,null,null,null,null,null,null,null,null,null,null,{"$f":"INDEX(NACECODETRANS[],$AX32,OFSELECETEDLANGUAGECODE,1)","v":"37 - Recycling of waste products                                          "},null,null,null,"Microsoft Dynamics GP",null,"British Indian Ocean Territory",null,"Mayotte",null,32,"Customer Details:","Angaben zum Kunden:","カスタマー詳細",null,null,null,null,null,null,null,null,null,null,null,32,"37 - Recycling of waste products                                          ","37 - Recycling of waste products                                          ","400000  電気、ガス、熱供給業"]
[null,{"$f":"INDEX(ORDERFORMTRANSTABLE[],$AI21,OFSELECETEDLANGUAGECODE,1)","v":"To                                 Address 1: "},null,null,{"$f":"INDEX(ORDERFORMTRANSTABLE[],$AI24,OFSELECETEDLANGUAGECODE,1)","v":"Postal Code/ZIP: "},null,null,null,null,null,null,null,null,null,null,null,null,null,null,null,null,null,null,null,{"$f":"INDEX(NACECODETRANS[],$AX33,OFSELECETEDLANGUAGECODE,1)","v":"40 - Electricity, gas and heat supply                                     "},null,null,null,"Microsoft Dynamics GP Perpetual",null,"Brunei",null,"Monaco",null,33,"Order Type:","Bitte Art der Bestellung auswählen:","オーダータイプを選択してください。",null,null,null,null,null,null,null,null,null,null,null,33,"40 - Electricity, gas and heat supply                                     ","40 - Electricity, gas and heat supply                                     ","410000  水道業"]
[null,{"$f":"INDEX(ORDERFORMTRANSTABLE[],$AI22,OFSELECETEDLANGUAGECODE,1)","v":"Details                  Address 2/State: "},null,null,{"$f":"INDEX(ORDERFORMTRANSTABLE[],$AI25,OFSELECETEDLANGUAGECODE,1)","v":"Country: "},"Venezuela",null,null,null,null,null,null,null,null,null,null,null,null,null,null,null,null,null,null,{"$f":"INDEX(NACECODETRANS[],$AX34,OFSELECETEDLANGUAGECODE,1)","v":"41 - Water supply                                                         "},null,null,null,"Microsoft Dynamics SL",null,"Bulgaria",null,"Netherlands, The",null,34,"Customer Name: ","Kundenname:","お客さま名",null,null,null,null,null,null,null,null,null,null,null,34,"41 - Water supply                                                         ","41 - Water supply                                                         ","450000  建設業"]
[null,null,null,null,null,null,null,null,null,null,null,null,null,null,null,null,null,null,null,null,null,null,null,null,{"$f":"INDEX(NACECODETRANS[],$AX35,OFSELECETEDLANGUAGECODE,1)","v":"45 - Building and construction work                                       "},null,null,null,"Microsoft Dynamics CRM",null,"Burkina Faso",null,"Norway",null,35,"VOICE Account Number (if Applicable):","VOICE Account Number (wenn vorhanden)","VOICEアカウント（該当する場合のみ）",null,null,null,null,null,null,null,null,null,null,null,35,"45 - Building and construction work                                       ","45 - Building and construction work                                       ","500000  自動車販売、整備・修理業"]
[null,{"$f":"INDEX(ORDERFORMTRANSTABLE[],$AI26,OFSELECETEDLANGUAGECODE,1)","v":"Partner Details:"},null,null,null,null,null,null,null,null,null,null,null,null,null,null,null,null,null,null,null,null,null,null,{"$f":"INDEX(NACECODETRANS[],$AX36,OFSELECETEDLANGUAGECODE,1)","v":"50 - Auto trade, maintenance and repairs including service station        "},null,"CONFIRM",null,"Microsoft Dynamics RMS",null,"Burundi",null,"Poland",null,36,"VOICE Account Number:","VOICE Account Number:","VOICEアカウント",null,null,null,null,null,null,null,null,null,null,null,36,"50 - Auto trade, maintenance and repairs including service station        ","50 - Auto trade, maintenance and repairs including service station        ","510000  卸売り・仲介業"]
[null,null,null,null,null,null,null,null,null,null,null,null,null,null,null,null,null,null,null,null,null,null,null,null,{"$f":"INDEX(NACECODETRANS[],$AX37,OFSELECETEDLANGUAGECODE,1)","v":"51 - Wholesale trade and agency trade                                     "},null,"Yes",null,"Microsoft Dynamics C5",null,"Cambodia",null,"Portugal",null,37,"Enhancement Plan required for: ","Enhancement Plan required for:","エンハンスメントプラン タイプ",null,null,null,null,null,null,null,null,null,null,null,37,"51 - Wholesale trade and agency trade                                     ","51 - Wholesale trade and agency trade                                     ","520000  自動車以外の販売業"]
[null,{"$f":"INDEX(ORDERFORMTRANSTABLE[],$AI27,OFSELECETEDLANGUAGECODE,1)","v":"VOICE Account Number: "},null,null,{"$f":"INDEX(ORDERFORMTRANSTABLE[],$AI29,OFSELECETEDLANGUAGECODE,1)","v":"Partner Name (as per VOICE): "},null,null,null,null,null,null,null,null,null,null,null,null,null,null,null,null,null,null,null,{"$f":"INDEX(NACECODETRANS[],$AX38,OFSELECETEDLANGUAGECODE,1)","v":"52 - Retail trade excluding autos                                         "},null,"No",null,"Microsoft Dynamics NAV",null,"Cameroon",null,"Reunion",null,38,"FROM Product Line:","FROM Product Line:","この製品ラインから",null,null,null,null,null,null,null,null,null,null,null,38,"52 - Retail trade excluding autos                                         ","52 - Retail trade excluding autos                                         ","550000  ホテル・レストラン業"]
[null,{"$f":"INDEX(ORDERFORMTRANSTABLE[],$AI28,OFSELECETEDLANGUAGECODE,1)","v":"Distributor Order: "},"No",null,{"$f":"INDEX(ORDERFORMTRANSTABLE[],$AI30,OFSELECETEDLANGUAGECODE,1)","v":"Distributor Account Number:"},null,null,null,null,null,null,null,null,null,null,null,null,null,null,null,null,null,null,null,{"$f":"INDEX(NACECODETRANS[],$AX39,OFSELECETEDLANGUAGECODE,1)","v":"55 - Hotel and restaurant business                                        "},null,null,null,"Microsoft Dynamics NAV Perpetual",null,"Canada",null,"Romania",null,39,"Product Line:","Product Line:","製品ライン",null,null,null,null,null,null,null,null,null,null,null,39,"55 - Hotel and restaurant business                                        ","55 - Hotel and restaurant business                                        ","600000  陸上運搬・パイプライン運搬業"]
[null,null,null,null,{"$f":"INDEX(ORDERFORMTRANSTABLE[],$AI31,OFSELECETEDLANGUAGECODE,1)","v":"Distributor Name:"},null,null,null,null,null,null,null,null,null,null,null,null,null,null,null,null,null,null,null,{"$f":"INDEX(NACECODETRANS[],$AX40,OFSELECETEDLANGUAGECODE,1)","v":"60 - Overland transportion, pipeline transportion                         "},null,null,null,"Microsoft Dynamics NAV MBL",null,"Cape Verde",null,"Saint Helena",null,40,"TO Product Line:","TO Product Line:","この製品ラインへ",null,null,null,null,null,null,null,null,null,null,null,40,"60 - Overland transportion, pipeline transportion                         ","60 - Overland transportion, pipeline transportion                         ","610000  船舶業"]
[null,null,null,null,null,null,null,null,null,null,null,null,null,null,null,null,null,null,null,null,null,null,null,null,{"$f":"INDEX(NACECODETRANS[],$AX41,OFSELECETEDLANGUAGECODE,1)","v":"61 - Shipping                                                             "},null,null,null,"Microsoft Dynamics AX MBL",null,"Cayman Islands",null,"San Marino",null,41,"Protected List Price (PLP) Currency: ","Protected List Price (PLP) Currency: ","Protected List Price (PLP) Currency: ",null,null,null,null,null,null,null,null,null,null,null,41,"61 - Shipping                                                             ","61 - Shipping                                                             ","620000  航空業"]
[null,{"$f":"INDEX(ORDERFORMTRANSTABLE[],$AI32,OFSELECETEDLANGUAGECODE,1)","v":"Customer Details:"},null,null,null,null,null,null,null,null,null,null,null,null,null,null,null,null,null,null,null,null,null,null,{"$f":"INDEX(NACECODETRANS[],$AX42,OFSELECETEDLANGUAGECODE,1)","v":"62 - Air transport                                                        "},null,null,null,"Microsoft Dynamics GP MBL",null,"Central African Republic",null,"Slovakia",null,42,"NAV Object Assignments Required: ","NAV Object Assignments Required: ","NAVオブジェクト割り当て: ",null,null,null,null,null,null,null,null,null,null,null,42,"62 - Air transport                                                        ","62 - Air transport                                                        ","630000  旅行関連業"]
[null,null,null,null,3,null,null,null,null,null,null,null,null,null,null,null,null,null,null,null,null,null,null,null,{"$f":"INDEX(NACECODETRANS[],$AX43,OFSELECETEDLANGUAGECODE,1)","v":"63 - Auxillary operations related to transport and travel                 "},null,"UPGRADE",null,"Microsoft Dynamics SL MBL",null,"Chad",null,"Slovenia",null,43,"Upgrade Transition Type:","Upgrade Transition Type:","アップグレード/移行タイプ",null,null,null,null,null,null,null,null,null,null,null,43,"63 - Auxillary operations related to transport and travel                 ","63 - Auxillary operations related to transport and travel                 ","640000  通信関連業"]
[null,{"$f":"INDEX(ORDERFORMTRANSTABLE[],$AI33,OFSELECETEDLANGUAGECODE,1)","v":"Order Type:"},"None Selected",null,null,null,null,null,null,null,null,null,null,null,null,null,null,null,null,null,null,null,null,null,{"$f":"INDEX(NACECODETRANS[],$AX44,OFSELECETEDLANGUAGECODE,1)","v":"64 - Postal service and telecommunication                                 "},null,{"$f":"INDEX(UPGRADETRANS[],$BC2,OFSELECETEDLANGUAGECODE,1)","v":"Formula Based Upgrade/Transition"},null,"Microsoft Dynamics C5 Light",null,"Chile",null,"Spain",null,44,"Click here for NAV Object Assignments","Click here for NAV Object Assignments","こちらをクリック",null,null,null,null,null,null,null,null,null,null,null,44,"64 - Postal service and telecommunication                                 ","64 - Postal service and telecommunication                                 ","650000  金融機関"]
[null,null,null,null,null,null,null,null,null,null,null,null,null,null,null,null,null,null,null,null,null,null,null,null,{"$f":"INDEX(NACECODETRANS[],$AX45,OFSELECETEDLANGUAGECODE,1)","v":"65 - Banking establishments and finance activities                        "},null,{"$f":"INDEX(UPGRADETRANS[],$BC3,OFSELECETEDLANGUAGECODE,1)","v":"Credit Based Upgrade/Transition"},null,null,null,"China",null,"Svalbard and Jan Mayen",null,45,"Address 1:","Adresse 1:","住所1",null,null,null,null,null,null,null,null,null,null,null,45,"65 - Banking establishments and finance activities                        ","65 - Banking establishments and finance activities                        ","660000  保険業"]
[null,{"$f":"INDEX(ORDERFORMTRANSTABLE[],$AI34,OFSELECETEDLANGUAGECODE,1)","v":"Customer Name: "},null,null,{"$f":"IF(C45=\"New License\",INDEX(ORDERFORMTRANSTABLE[],$AI45,OFSELECETEDLANGUAGECODE,1),\"\")","v":""},null,null,null,null,null,null,null,null,null,null,null,null,null,null,null,null,null,null,null,{"$f":"INDEX(NACECODETRANS[],$AX46,OFSELECETEDLANGUAGECODE,1)","v":"66 - Insurance activities                                                 "},null,null,null,null,null,"Christmas Island",null,"Sweden",null,46,"Address 2:","Adresse 2:","住所2",null,null,null,null,null,null,null,null,null,null,null,46,"66 - Insurance activities                                                 ","66 - Insurance activities                                                 ","670000  金融サービス業"]
[null,{"$f":"IF(C45=\"New License\",INDEX(ORDERFORMTRANSTABLE[],$AI35,OFSELECETEDLANGUAGECODE,1),INDEX(ORDERFORMTRANSTABLE[],$AI36,OFSELECETEDLANGUAGECODE,1))","v":"VOICE Account Number:"},null,null,{"$f":"IF(C45=\"New License\",INDEX(ORDERFORMTRANSTABLE[],$AI46,OFSELECETEDLANGUAGECODE,1),INDEX(ORDERFORMTRANSTABLE[],$AI47,OFSELECETEDLANGUAGECODE,1))","v":"OR        License Serial Number:"},null,null,null,null,null,null,null,null,null,null,null,null,null,null,null,null,null,null,null,{"$f":"INDEX(NACECODETRANS[],$AX47,OFSELECETEDLANGUAGECODE,1)","v":"67 - Service industry related to banking, finance and insurance activities"},null,null,null,null,null,"Cocos (Keeling) Islands",null,"Switzerland",null,47,"OR        License Serial Number:","ODER         Lizenzseriennummer:","又はライセンスシリアル番号",null,null,null,null,null,null,null,null,null,null,null,47,"67 - Service industry related to banking, finance and insurance activities","67 - Service industry related to banking, finance and insurance activities","700000  不動産業"]
[null,{"$f":"IF(C46=\"New License\",INDEX(ORDERFORMTRANSTABLE[],$AI36,OFSELECETEDLANGUAGECODE,1),INDEX(ORDERFORMTRANSTABLE[],$AI37,OFSELECETEDLANGUAGECODE,1))","v":"Enhancement Plan required for: "},"1 Year",null,{"$f":"IF(C45=\"New License\",INDEX(ORDERFORMTRANSTABLE[],$AI48,OFSELECETEDLANGUAGECODE,1),\"\")","v":""},null,null,null,null,null,null,null,null,null,null,null,null,null,null,null,null,null,null,null,{"$f":"INDEX(NACECODETRANS[],$AX48,OFSELECETEDLANGUAGECODE,1)","v":"70 - Real estate industry                                                 "},null,"CURRENCY",null,null,null,"Colombia",null,"United Kingdom",null,48,"City: ","Ort:","都道府県・市",null,null,null,null,null,null,null,null,null,null,null,48,"70 - Real estate industry                                                 ","70 - Real estate industry                                                 ","710000  自動車、機械器具レンタル業"]
[null,{"$f":"IF(C45=\"Transition\",INDEX(ORDERFORMTRANSTABLE[],$AI38,OFSELECETEDLANGUAGECODE,1),IF(C45=\"New License\",INDEX(ORDERFORMTRANSTABLE[],$AI39,OFSELECETEDLANGUAGECODE,1),\"\"))","v":""},"All",null,{"$f":"IF(C45=\"New License\",INDEX(ORDERFORMTRANSTABLE[],$AI49,OFSELECETEDLANGUAGECODE,1),\"\")","v":""},null,null,null,null,null,null,null,null,null,null,null,null,null,null,null,null,null,null,null,{"$f":"INDEX(NACECODETRANS[],$AX49,OFSELECETEDLANGUAGECODE,1)","v":"71 - Rental of automobiles, machines, equipment, etc.                     "},null,"CHF",null,null,null,"Comoros",null,"Vatican City",null,49,"Postal code/Zip:","Postal code/Zip:","郵便番号",null,null,null,null,null,null,null,null,null,null,null,49,"71 - Rental of automobiles, machines, equipment, etc.                     ","71 - Rental of automobiles, machines, equipment, etc.                     ","720000  データー加工業"]
[null,{"$f":"IF(B50=INDEX(ORDERFORMTRANSTABLE[],$AI38,OFSELECETEDLANGUAGECODE,1),INDEX(ORDERFORMTRANSTABLE[],$AI40,OFSELECETEDLANGUAGECODE,1),\"\")","v":""},"Microsoft Dynamics NAV Perpetual",null,{"$f":"IF(C45=\"New License\",INDEX(ORDERFORMTRANSTABLE[],$AI50,OFSELECETEDLANGUAGECODE,1),\"\")","v":""},"Afghanistan",null,null,null,null,null,null,null,null,null,null,null,null,null,null,null,null,null,null,{"$f":"INDEX(NACECODETRANS[],$AX50,OFSELECETEDLANGUAGECODE,1)","v":"72 - Data processing industry                                             "},null,"DKK",null,null,null,"Congo",null,null,null,50,"Country: ","Country: ","国",null,null,null,null,null,null,null,null,null,null,null,50,"72 - Data processing industry                                             ","72 - Data processing industry                                             ","730000  研究・開発"]
[null,{"$f":"IFERROR(IF(AND(F51=VLOOKUP(F51,EEASCOUNTRY2,1,FALSE),C45=\"New License\"),INDEX(ORDERFORMTRANSTABLE[],$AI41,OFSELECETEDLANGUAGECODE,1),\"\"),\"\")","v":""},"EUR",{"$f":"IFERROR(IF(AND(F51=VLOOKUP(F51,EEASCOUNTRY2,1,FALSE),C45=\"New License\"),INDEX(ORDERFORMTRANSTABLE[],$AI51,OFSELECETEDLANGUAGECODE,1),\"\"),\"\")","v":""},null,null,null,null,null,null,null,null,null,null,null,null,null,null,null,null,null,null,null,null,{"$f":"INDEX(NACECODETRANS[],$AX51,OFSELECETEDLANGUAGECODE,1)","v":"73 - Research and development                                             "},null,"EUR",null,null,null,"Congo (DRC)",null,null,null,51,"Important - PLP currency selection is final and cannot be changed again for the lifetime of the customer account","Important - PLP currency selection is final and cannot be changed again for the lifetime of the customer account","Important - PLP currency selection is final and cannot be changed again for the lifetime of the customer account",null,null,null,null,null,null,null,null,null,null,null,51,"73 - Research and development                                             ","73 - Research and development                                             ","740000  その他"]
[null,{"$f":"IF(C45=\"New License\",IF(C50=\"Microsoft Dynamics NAV\",INDEX(ORDERFORMTRANSTABLE[],$AI42,OFSELECETEDLANGUAGECODE,1),IF(C50=\"Microsoft Dynamics NAV MBL\",INDEX(ORDERFORMTRANSTABLE[],$AI42,OFSELECETEDLANGUAGECODE,1),IF(C50=\"Microsoft Dynamics NAV 2013\",INDEX(ORDERFORMTRANSTABLE[],$AI42,OFSELECETEDLANGUAGECODE,1),\"\"))),IF(C45=\"Transition\",IF(C51=\"Microsoft Dynamics NAV\",INDEX(ORDERFORMTRANSTABLE[],$AI42,OFSELECETEDLANGUAGECODE,1),IF(C51=\"Microsoft Dynamics NAV 2013\",INDEX(ORDERFORMTRANSTABLE[],$AI42,OFSELECETEDLANGUAGECODE,1),IF(C51=\"Microsoft Dynamics NAV\",INDEX(ORDERFORMTRANSTABLE[],$AI42,OFSELECETEDLANGUAGECODE,1),\"\"))),IF(OR(C45=\"Additional Product + Enhancement Renewal\",C45=\"Additional Product\"),INDEX(ORDERFORMTRANSTABLE[],$AI42,OFSELECETEDLANGUAGECODE,1),\"\")))","v":""},"No",null,null,null,null,null,null,null,null,null,null,null,null,null,null,null,null,null,null,null,null,null,{"$f":"INDEX(NACECODETRANS[],$AX52,OFSELECETEDLANGUAGECODE,1)","v":"74 - Other business services                                              "},null,"GBP",null,null,null,"Cook Islands",null,null,null,52,"Email: ","Email: ","Email: ",null,null,null,null,null,null,null,null,null,null,null,52,"74 - Other business services                                              ","74 - Other business services                                              ","750000  公務員、国防、国保"]
[null,{"$f":"IF(AND($C$51=\"Microsoft Dynamics AX 2012\",OR($C$50=\"Microsoft Dynamics AX\",$C$50=\"Microsoft Dynamics AX MBL\")),INDEX(ORDERFORMTRANSTABLE[],$AI43,OFSELECETEDLANGUAGECODE,1),\"\")","v":""},"Credit Based Upgrade/Transition",null,{"$f":"IF(C45=\"New License\",INDEX(ORDERFORMTRANSTABLE[],$AI52,OFSELECETEDLANGUAGECODE,1),\"\")","v":""},null,null,null,null,null,null,null,null,null,null,null,null,null,null,null,null,null,null,null,{"$f":"INDEX(NACECODETRANS[],$AX53,OFSELECETEDLANGUAGECODE,1)","v":"75 - Civil service, national defense and national insurance               "},null,"NOK",null,null,null,"Costa Rica",null,null,null,53,"NACE Code:","NACE Code:","NACE コード",null,null,null,null,null,null,null,null,null,null,null,53,"75 - Civil service, national defense and national insurance               ","75 - Civil service, national defense and national insurance               ","800000  教育機関"]
[null,{"$f":"IF(B53<>\"NAV Object Assignments Required: \",\"\",IF(C53=\"Yes\",INDEX(ORDERFORMTRANSTABLE[],$AI44,OFSELECETEDLANGUAGECODE,1),\"\"))","v":""},null,null,{"$f":"IF(C45=\"New License\",INDEX(ORDERFORMTRANSTABLE[],$AI53,OFSELECETEDLANGUAGECODE,1),\"\")","v":""},"1 - Agriculture, hunting, etc.                                           ",null,null,null,null,null,null,null,null,null,null,null,null,null,null,null,null,null,null,{"$f":"INDEX(NACECODETRANS[],$AX54,OFSELECETEDLANGUAGECODE,1)","v":"80 - Education                                                            "},null,"SEK",null,null,null,"Côte d'Ivoire",null,null,null,54,"Phone:","Phone:","電話番号",null,null,null,null,null,null,null,null,null,null,null,54,"80 - Education                                                            ","80 - Education                                                            "]
[null,null,null,null,{"$f":"IF(C45=\"New License\",INDEX(ORDERFORMTRANSTABLE[],$AI54,OFSELECETEDLANGUAGECODE,1),\"\")","v":""},null,null,null,null,null,null,null,null,null,null,null,null,null,null,null,null,null,null,null,{"$f":"INDEX(NACECODETRANS[],$AX55,OFSELECETEDLANGUAGECODE,1)","v":"85 - Health and social services                                           "},null,null,null,null,null,"Croatia",null,null,null,55,"Contact Name:","Contact Name:","ご担当者名",null,null,null,null,null,null,null,null,null,null,null,55,"85 - Health and social services                                           ","85 - Health and social services                                           "]
[null,null,{"$f":"IF(E57<>\"\",INDEX(ORDERFORMTRANSTABLE[],$AI63,OFSELECETEDLANGUAGECODE,1),\"\")","v":""},null,{"$f":"IFERROR(IF(C45=\"New License\",INDEX(ORDERFORMTRANSTABLE[],$AI55,OFSELECETEDLANGUAGECODE,1),IF(C45=\"Transition\",AC20,\"\")),\"\")","v":""},null,null,null,"None Selected",null,null,null,null,null,null,null,null,null,null,null,null,null,null,null,{"$f":"INDEX(NACECODETRANS[],$AX56,OFSELECETEDLANGUAGECODE,1)","v":"90 - Sewage service, department of sanitation etc.                        "},null,null,null,null,null,"Cuba",null,null,null,56,"Edition Transition","Edition Transition","エディションの移行",null,null,null,null,null,null,null,null,null,null,null,56,"90 - Sewage service, department of sanitation etc.                        ","90 - Sewage service, department of sanitation etc.                        "]
[null,null,null,null,null,null,null,null,null,null,null,null,null,null,null,null,null,null,null,null,null,null,null,null,{"$f":"INDEX(NACECODETRANS[],$AX57,OFSELECETEDLANGUAGECODE,1)","v":"91 - Organizations and associations                                       "},null,null,null,null,null,"Cyprus",null,null,null,57,"For Microsoft Dynamics AX 2012 Orders, please indicate if the customer meets any of the following criteria:\n(To comply with certain reporting requirements, Microsoft must obtain customer segmentation data for certain public sector organizations.  The information you provide about the customer must be true and accurate to the best of your knowledge)","For Microsoft Dynamics AX 2012 Orders, please indicate if the customer meets any of the following criteria:\n(To comply with certain reporting requirements, Microsoft must obtain customer segmentation data for certain public sector organizations.  The information you provide about the customer must be true and accurate to the best of your knowledge)","Microsoft Dynamics AX2012をご注文になる場合、顧客が次の基準を満たしているか確認をしてください。\n(マイクロソフトは特定の報告義務に基づき、パブリックセクターの顧客のセグメントデータを把握する必要があります。\n貴社は分かる範囲において正しく正確である必要があります)",null,null,null,null,null,null,null,null,null,null,null,57,"91 - Organizations and associations                                       ","91 - Organizations and associations                                       "]
[null,{"$f":"INDEX(ORDERFORMTRANSTABLE[],$AI57,OFSELECETEDLANGUAGECODE,1)","v":"For Microsoft Dynamics AX 2012 Orders, please indicate if the customer meets any of the following criteria:\n(To comply with certain reporting requirements, Microsoft must obtain customer segmentation data for certain public sector organizations.  The information you provide about the customer must be true and accurate to the best of your knowledge)"},null,null,null,null,null,null,null,null,null,null,null,null,null,null,null,null,null,null,null,null,null,null,{"$f":"INDEX(NACECODETRANS[],$AX58,OFSELECETEDLANGUAGECODE,1)","v":"92 - Entertainment, culture and sports                                    "},null,null,null,null,null,"Czech Republic",null,null,null,58,"PUBLIC SECTOR (GOVERNMENT) : an agency, department, office, instrumentality, district, division, unit, or other entity performing executive, legislative, judicial, regulatory, public service, administrative, internal or other functions of a national, regional, state, or local government of the United States or any other country or territory","PUBLIC SECTOR (GOVERNMENT) : an agency, department, office, instrumentality, district, division, unit, or other entity performing executive, legislative, judicial, regulatory, public service, administrative, internal or other functions of a national, regional, state, or local government of the United States or any other country or territory","パブリック セクター （政府機関）：アメリカ合衆国またはその他の国または地域において、国内またはその他の行政、立法、司法、規制、公共サービス、行政管理の機能を実行する、機関、部門、オフィス、地区、事業部、ユニットまたはその他のエンティティー",null,null,null,null,null,null,null,null,null,null,null,58,"92 - Entertainment, culture and sports                                    ","92 - Entertainment, culture and sports                                    "]
[null,null,null,null,null,null,null,null,null,null,null,null,null,null,null,null,null,null,null,null,null,null,null,null,{"$f":"INDEX(NACECODETRANS[],$AX59,OFSELECETEDLANGUAGECODE,1)","v":"93 - Other services                                                       "},null,null,null,null,null,"Denmark",null,null,null,59,"PUBLIC SECTOR (NON PROFIT - COOPERATIVE) : a not-for-profit or co-operative (e.g., utility co-operative) chartered by or under contract with a government entity in the United States or any other country or territory to provide traditional government or public services which the government entity has elected to privatize","PUBLIC SECTOR (NON PROFIT - COOPERATIVE) : a not-for-profit or co-operative (e.g., utility co-operative) chartered by or under contract with a government entity in the United States or any other country or territory to provide traditional government or public services which the government entity has elected to privatize","パブリックセクター （非営利企業) :    政府機関の民営化のため選定された或いは政府・公共にサービスを提供するためにアメリカ合衆国政府または他の国または地域の政府機関との契約に基づき設立が許可された非営利または協同組合（例えば、公益事業共同組合)",null,null,null,null,null,null,null,null,null,null,null,59,"93 - Other services                                                       ","93 - Other services                                                       "]
[null,null,null,null,null,null,null,null,null,null,null,null,null,null,null,null,null,null,null,null,null,null,null,null,{"$f":"INDEX(NACECODETRANS[],$AX60,OFSELECETEDLANGUAGECODE,1)","v":"95 - Private housekeeping including hired help                            "},null,null,null,null,null,"Djibouti",null,null,null,60,"PUBLIC SECTOR (EDUCATION) : a public school, public educational entity, or public institute of higher learning in  the United States or any other country or territory","PUBLIC SECTOR (EDUCATION) : a public school, public educational entity, or public institute of higher learning in  the United States or any other country or territory","パブリックセクター （教育) :   アメリカ合衆国政府またはその他の国又は地域の公立学校、公共の教育団体または高等教育のための公共研究所\n",null,null,null,null,null,null,null,null,null,null,null,60,"95 - Private housekeeping including hired help                            ","95 - Private housekeeping including hired help                            "]
[null,{"$f":"INDEX(ORDERFORMTRANSTABLE[],$AI58,OFSELECETEDLANGUAGECODE,1)","v":"PUBLIC SECTOR (GOVERNMENT) : an agency, department, office, instrumentality, district, division, unit, or other entity performing executive, legislative, judicial, regulatory, public service, administrative, internal or other functions of a national, regional, state, or local government of the United States or any other country or territory"},null,null,null,null,"No",{"$f":"IF(AND(G62=\"Yes\",COUNTIF(G62:G67,\"Yes\")>1),\"Error\",\"\")","v":""},null,null,null,null,null,null,null,null,null,null,null,null,null,null,null,null,{"$f":"INDEX(NACECODETRANS[],$AX61,OFSELECETEDLANGUAGECODE,1)","v":"98 - Undeclared                                                           "},null,null,null,null,null,"Dominica",null,null,null,61,"NONE OF THE ABOVE","NONE OF THE ABOVE","いずれにも該当しない ",null,null,null,null,null,null,null,null,null,null,null,61,"98 - Undeclared                                                           ","98 - Undeclared                                                           "]
[null,null,null,null,null,null,null,null,null,null,null,null,null,null,null,null,null,null,null,null,null,null,null,null,{"$f":"INDEX(NACECODETRANS[],$AX62,OFSELECETEDLANGUAGECODE,1)","v":"99 - International organizations, etc.                                    "},null,null,null,null,null,"Dominican Republic",null,null,null,62,"Additional Comments:","Zusätzliche Bemerkungen oder Hinweise:","追記・特記事項",null,null,null,null,null,null,null,null,null,null,null,62,"99 - International organizations, etc.                                    ","99 - International organizations, etc.                                    "]
[null,{"$f":"INDEX(ORDERFORMTRANSTABLE[],$AI59,OFSELECETEDLANGUAGECODE,1)","v":"PUBLIC SECTOR (NON PROFIT - COOPERATIVE) : a not-for-profit or co-operative (e.g., utility co-operative) chartered by or under contract with a government entity in the United States or any other country or territory to provide traditional government or public services which the government entity has elected to privatize"},null,null,null,null,"No",{"$f":"IF(AND(G64=\"Yes\",COUNTIF(G62:G67,\"Yes\")>1),\"Error\",\"\")","v":""},null,null,null,null,null,null,null,null,null,null,null,null,null,null,null,null,null,null,null,null,null,null,"Ecuador",null,null,null,63,"Transisiton Type:","Transisiton Type:","移行の種類"]
[null,null,null,null,null,null,null,null,null,null,null,null,null,null,null,null,null,null,null,null,null,null,null,null,null,null,null,null,null,null,"Egypt",null,null,null,64,"This section is only applicable to Microsoft Dynamics AX 2012 Step-Up Orders ","This section is only applicable to Microsoft Dynamics AX 2012 Step-Up Orders ","このセクションはMicrosoft Dynamics AX 2012ステップ アップオーダーのために使用されます"]
[null,{"$f":"INDEX(ORDERFORMTRANSTABLE[],$AI60,OFSELECETEDLANGUAGECODE,1)","v":"PUBLIC SECTOR (EDUCATION) : a public school, public educational entity, or public institute of higher learning in  the United States or any other country or territory"},null,null,null,null,"No",{"$f":"IF(AND(G66=\"Yes\",COUNTIF(G62:G67,\"Yes\")>1),\"Error\",\"\")","v":""},null,null,null,null,null,null,null,null,null,null,null,null,null,null,null,null,null,null,null,null,null,null,"El Salvador",null,null,null,65,"Users","Users","ユーザー"]
[null,{"$f":"INDEX(ORDERFORMTRANSTABLE[],$AI61,OFSELECETEDLANGUAGECODE,1)","v":"NONE OF THE ABOVE"},null,null,null,null,"No",{"$f":"IF(AND(G67=\"Yes\",COUNTIF(G62:G67,\"Yes\")>1),\"Error\",\"\")","v":""},null,null,null,null,null,null,null,null,null,null,null,null,null,null,null,null,null,null,null,null,null,null,"Equatorial Guinea",null,null,null,66,"Enterprise User","Enterprise User","エンタープライズ ユーザー"]
[null,{"$f":"INDEX(ORDERFORMTRANSTABLE[],$AI64,OFSELECETEDLANGUAGECODE,1)","v":"This section is only applicable to Microsoft Dynamics AX 2012 Step-Up Orders "},null,null,null,null,null,null,null,null,null,null,null,null,null,null,null,null,null,null,null,null,null,null,null,null,null,null,null,null,"Eritrea",null,null,null,67,"Functional User","Functional User","ファンクショナル ユーザー"]
[null,null,null,null,null,null,null,null,null,null,null,null,null,null,null,null,null,null,null,null,null,null,null,null,null,null,null,null,null,null,"Estonia",null,null,null,68,"Task User","Task User","タスク ユーザー"]
[null,{"$f":"INDEX(ORDERFORMTRANSTABLE[],$AI65,OFSELECETEDLANGUAGECODE,1)","v":"Users"},{"$f":"INDEX(ORDERFORMTRANSTABLE[],$AI71,OFSELECETEDLANGUAGECODE,1)","v":"Own"},null,{"$f":"INDEX(ORDERFORMTRANSTABLE[],$AI72,OFSELECETEDLANGUAGECODE,1)","v":"Need"},{"$f":"INDEX(ORDERFORMTRANSTABLE[],$AI73,OFSELECETEDLANGUAGECODE,1)","v":"Changed"},null,null,null,null,null,null,null,null,null,null,null,null,null,null,null,null,null,null,null,null,null,null,null,null,"Ethiopia",null,null,null,69,"Self Serve User","Self Serve User","セルフ サーバー ユーザー"]
[null,{"$f":"INDEX(ORDERFORMTRANSTABLE[],$AI66,OFSELECETEDLANGUAGECODE,1)","v":"Enterprise User"},0,null,0,{"$f":"E71-C71","v":0},null,null,null,null,null,null,null,null,null,null,null,null,null,null,null,null,null,null,null,null,null,null,null,null,"Falkland Islands (Islas Malvinas)",null,null,null,70,"Total","Total","トータル"]
[null,{"$f":"INDEX(ORDERFORMTRANSTABLE[],$AI67,OFSELECETEDLANGUAGECODE,1)","v":"Functional User"},0,null,0,{"$f":"E72-C72","v":0},null,null,null,null,null,null,null,null,null,null,null,null,null,null,null,null,null,null,null,null,null,null,null,null,"Faroe Islands",null,null,null,71,"Own","Own","所有数"]
[null,{"$f":"INDEX(ORDERFORMTRANSTABLE[],$AI68,OFSELECETEDLANGUAGECODE,1)","v":"Task User"},0,null,0,{"$f":"E73-C73","v":0},null,null,null,null,null,null,null,null,null,null,null,null,null,null,null,null,null,null,null,null,null,null,null,null,"Fiji Islands",null,null,null,72,"Need","Need","必要数"]
[null,{"$f":"INDEX(ORDERFORMTRANSTABLE[],$AI69,OFSELECETEDLANGUAGECODE,1)","v":"Self Serve User"},0,null,0,{"$f":"E74-C74","v":0},null,null,null,null,null,null,null,null,null,null,null,null,null,null,null,null,null,null,null,null,null,null,null,null,"Finland",null,null,null,73,"Changed","Changed","変更数"]
[null,{"$f":"INDEX(ORDERFORMTRANSTABLE[],$AI70,OFSELECETEDLANGUAGECODE,1)","v":"Total"},{"$f":"C71+C72+C73+C74","v":0},null,{"$f":"E71+E72+E73+E74","v":0},{"$f":"E75-C75","v":0},null,null,null,null,null,null,null,null,null,null,null,null,null,null,null,null,null,null,null,null,null,null,null,null,"France",null,null,null,74,null,null,"7.メディアの注文については、別途Microsoft_Dynamics_Media_Price_List_Japanをご使用ください。"]
[null,null,null,null,null,null,null,null,null,null,null,null,null,null,null,null,null,null,null,null,null,null,null,null,null,null,null,null,null,null,"French Guiana",null,null,null,75,"Special Deal / Promoweb: ","Special Deal / Promoweb: ","特別割引:"]
[null,{"$f":"INDEX(ORDERFORMTRANSTABLE[],$AI62,OFSELECETEDLANGUAGECODE,1)","v":"Additional Comments:"},null,null,null,null,null,null,null,null,null,null,null,null,null,null,null,null,null,null,null,null,null,null,null,null,null,null,null,null,"French Polynesia",null,null,null,76,"Deal ID/Promoweb ID:","Deal ID/Promoweb ID:","特別割引ID:"]
[null,null,null,null,null,null,null,null,null,null,null,null,null,null,null,null,null,null,null,null,null,null,null,null,null,null,null,null,null,null,"French Southern and Antarctic Lands",null,null,null,77,"Only the EUR pricelist can be selected for customers located within EU/EFTA","Only the EUR pricelist can be selected for customers located within EU/EFTA","顧客の所在地がEU/EFTA地域の場合EURO通貨の価格表のみが選択可能です。"]
[null,null,null,null,null,null,null,null,null,null,null,null,null,null,null,null,null,null,null,null,null,null,null,null,null,null,null,null,null,null,"Gabon",null,null,null,78,"Submission Details:","Submission Details:","提出先詳細："]
[null,null,null,null,null,null,null,null,null,null,null,null,null,null,null,null,null,null,null,null,null,null,null,null,null,null,null,null,null,null,"Gambia, The",null,null,null,79,"Where CLT is not available, please use:","Where CLT is not available, please use:","オンラインからお問い合わせが出来ない場合、こちらまでご連絡ください："]
[null,null,null,null,null,null,null,null,null,null,null,null,null,null,null,null,null,null,null,null,null,null,null,null,null,null,null,null,null,null,"Georgia",null,null,null,80,"mbsquery@microsoft.com","mbsquery@microsoft.com","mbslques@microsoft.com "]
[null,null,null,null,null,null,null,null,null,null,null,null,null,null,null,null,null,null,null,null,null,null,null,null,null,null,null,null,null,null,"Germany",null,null,null,81,"MIMOS Call Logging Tool","MIMOS Call Logging Tool","オンラインからの問い合わせ"]
[null,null,null,null,null,null,null,null,null,null,null,null,null,null,null,null,null,null,null,null,null,null,null,null,null,null,null,null,null,null,"Ghana",null,null,null,82,"MIMOS Operations Support Request","MIMOS Operations Support Request"]
[null,null,null,null,null,null,null,null,null,null,null,null,null,null,null,null,null,null,null,null,null,null,null,null,null,null,null,null,null,null,"Gibraltar",null,null,null,83,"mbsquery@microsoft.com","mbsquery@microsoft.com"]
[null,null,null,null,null,null,null,null,null,null,null,null,null,null,null,null,null,null,null,null,null,null,null,null,null,null,null,null,null,null,"Greece"]
[null,null,null,null,null,null,null,null,null,null,null,null,null,null,null,null,null,null,null,null,null,null,null,null,null,null,null,null,null,null,"Greenland"]
[null,null,null,null,null,null,null,null,null,null,null,null,null,null,null,null,null,null,null,null,null,null,null,null,null,null,null,null,null,null,"Grenada"]
[null,null,null,null,null,null,null,null,null,null,null,null,null,null,null,null,null,null,null,null,null,null,null,null,null,null,null,null,null,null,"Guadeloupe"]
[null,null,null,null,null,null,null,null,null,null,null,null,null,null,null,null,null,null,null,null,null,null,null,null,null,null,null,null,null,null,"Guam"]
[null,null,null,null,null,null,null,null,null,null,null,null,null,null,null,null,null,null,null,null,null,null,null,null,null,null,null,null,null,null,"Guatemala"]
[null,null,null,null,null,null,null,null,null,null,null,null,null,null,null,null,null,null,null,null,null,null,null,null,null,null,null,null,null,null,"Guinea"]
[null,null,null,null,null,null,null,null,null,null,null,null,null,null,null,null,null,null,null,null,null,null,null,null,null,null,null,null,null,null,"Guinea-Bissau"]
[null,null,null,null,null,null,null,null,null,null,null,null,null,null,null,null,null,null,null,null,null,null,null,null,null,null,null,null,null,null,"Guyana"]
[null,null,null,null,null,null,null,null,null,null,null,null,null,null,null,null,null,null,null,null,null,null,null,null,null,null,null,null,null,null,"Haiti"]
[null,null,null,null,null,null,null,null,null,null,null,null,null,null,null,null,null,null,null,null,null,null,null,null,null,null,null,null,null,null,"Heard Island and McDonald Islands"]
[null,null,null,null,null,null,null,null,null,null,null,null,null,null,null,null,null,null,null,null,null,null,null,null,null,null,null,null,null,null,"Honduras"]
[null,null,null,null,null,null,null,null,null,null,null,null,null,null,null,null,null,null,null,null,null,null,null,null,null,null,null,null,null,null,"Hong Kong SAR"]
[null,null,null,null,null,null,null,null,null,null,null,null,null,null,null,null,null,null,null,null,null,null,null,null,null,null,null,null,null,null,"Hungary"]
[null,null,null,null,null,null,null,null,null,null,null,null,null,null,null,null,null,null,null,null,null,null,null,null,null,null,null,null,null,null,"Iceland"]
[null,null,null,null,null,null,null,null,null,null,null,null,null,null,null,null,null,null,null,null,null,null,null,null,null,null,null,null,null,null,"India"]
[null,null,null,null,null,null,null,null,null,null,null,null,null,null,null,null,null,null,null,null,null,null,null,null,null,null,null,null,null,null,"Indonesia"]
[null,null,null,null,null,null,null,null,null,null,null,null,null,null,null,null,null,null,null,null,null,null,null,null,null,null,null,null,null,null,"Iran"]
[null,null,null,null,null,null,null,null,null,null,null,null,null,null,null,null,null,null,null,null,null,null,null,null,null,null,null,null,null,null,"Iraq"]
[null,null,null,null,null,null,null,null,null,null,null,null,null,null,null,null,null,null,null,null,null,null,null,null,null,null,null,null,null,null,"Ireland, Republic of"]
[null,null,null,null,null,null,null,null,null,null,null,null,null,null,null,null,null,null,null,null,null,null,null,null,null,null,null,null,null,null,"Israel"]
[null,null,null,null,null,null,null,null,null,null,null,null,null,null,null,null,null,null,null,null,null,null,null,null,null,null,null,null,null,null,"Italy"]
[null,null,null,null,null,null,null,null,null,null,null,null,null,null,null,null,null,null,null,null,null,null,null,null,null,null,null,null,null,null,"Jamaica"]
[null,null,null,null,null,null,null,null,null,null,null,null,null,null,null,null,null,null,null,null,null,null,null,null,null,null,null,null,null,null,"Jan Mayen"]
[null,null,null,null,null,null,null,null,null,null,null,null,null,null,null,null,null,null,null,null,null,null,null,null,null,null,null,null,null,null,"Japan"]
[null,null,null,null,null,null,null,null,null,null,null,null,null,null,null,null,null,null,null,null,null,null,null,null,null,null,null,null,null,null,"Jordan"]
[null,null,null,null,null,null,null,null,null,null,null,null,null,null,null,null,null,null,null,null,null,null,null,null,null,null,null,null,null,null,"Kazakhstan"]
[null,null,null,null,null,null,null,null,null,null,null,null,null,null,null,null,null,null,null,null,null,null,null,null,null,null,null,null,null,null,"Kenya"]
[null,null,null,null,null,null,null,null,null,null,null,null,null,null,null,null,null,null,null,null,null,null,null,null,null,null,null,null,null,null,"Kiribati"]
[null,null,null,null,null,null,null,null,null,null,null,null,null,null,null,null,null,null,null,null,null,null,null,null,null,null,null,null,null,null,"Korea, North"]
[null,null,null,null,null,null,null,null,null,null,null,null,null,null,null,null,null,null,null,null,null,null,null,null,null,null,null,null,null,null,"Korea, South"]
[null,null,null,null,null,null,null,null,null,null,null,null,null,null,null,null,null,null,null,null,null,null,null,null,null,null,null,null,null,null,"Kuwait"]
[null,null,null,null,null,null,null,null,null,null,null,null,null,null,null,null,null,null,null,null,null,null,null,null,null,null,null,null,null,null,"Kyrgyzstan"]
[null,null,null,null,null,null,null,null,null,null,null,null,null,null,null,null,null,null,null,null,null,null,null,null,null,null,null,null,null,null,"Laos"]
[null,null,null,null,null,null,null,null,null,null,null,null,null,null,null,null,null,null,null,null,null,null,null,null,null,null,null,null,null,null,"Latvia"]
[null,null,null,null,null,null,null,null,null,null,null,null,null,null,null,null,null,null,null,null,null,null,null,null,null,null,null,null,null,null,"Lebanon"]
[null,null,null,null,null,null,null,null,null,null,null,null,null,null,null,null,null,null,null,null,null,null,null,null,null,null,null,null,null,null,"Lesotho"]
[null,null,null,null,null,null,null,null,null,null,null,null,null,null,null,null,null,null,null,null,null,null,null,null,null,null,null,null,null,null,"Liberia"]
[null,null,null,null,null,null,null,null,null,null,null,null,null,null,null,null,null,null,null,null,null,null,null,null,null,null,null,null,null,null,"Libya"]
[null,null,null,null,null,null,null,null,null,null,null,null,null,null,null,null,null,null,null,null,null,null,null,null,null,null,null,null,null,null,"Liechtenstein"]
[null,null,null,null,null,null,null,null,null,null,null,null,null,null,null,null,null,null,null,null,null,null,null,null,null,null,null,null,null,null,"Lithuania"]
[null,null,null,null,null,null,null,null,null,null,null,null,null,null,null,null,null,null,null,null,null,null,null,null,null,null,null,null,null,null,"Luxembourg"]
[null,null,null,null,null,null,null,null,null,null,null,null,null,null,null,null,null,null,null,null,null,null,null,null,null,null,null,null,null,null,"Macao SAR"]
[null,null,null,null,null,null,null,null,null,null,null,null,null,null,null,null,null,null,null,null,null,null,null,null,null,null,null,null,null,null,"Macedonia"]
[null,null,null,null,null,null,null,null,null,null,null,null,null,null,null,null,null,null,null,null,null,null,null,null,null,null,null,null,null,null,"Madagascar"]
[null,null,null,null,null,null,null,null,null,null,null,null,null,null,null,null,null,null,null,null,null,null,null,null,null,null,null,null,null,null,"Madeira"]
[null,null,null,null,null,null,null,null,null,null,null,null,null,null,null,null,null,null,null,null,null,null,null,null,null,null,null,null,null,null,"Malawi"]
[null,null,null,null,null,null,null,null,null,null,null,null,null,null,null,null,null,null,null,null,null,null,null,null,null,null,null,null,null,null,"Malaysia"]
[null,null,null,null,null,null,null,null,null,null,null,null,null,null,null,null,null,null,null,null,null,null,null,null,null,null,null,null,null,null,"Maldives"]
[null,null,null,null,null,null,null,null,null,null,null,null,null,null,null,null,null,null,null,null,null,null,null,null,null,null,null,null,null,null,"Mali"]
[null,null,null,null,null,null,null,null,null,null,null,null,null,null,null,null,null,null,null,null,null,null,null,null,null,null,null,null,null,null,"Malta"]
[null,null,null,null,null,null,null,null,null,null,null,null,null,null,null,null,null,null,null,null,null,null,null,null,null,null,null,null,null,null,"Marshall Islands"]
[null,null,null,null,null,null,null,null,null,null,null,null,null,null,null,null,null,null,null,null,null,null,null,null,null,null,null,null,null,null,"Martinique"]
[null,null,null,null,null,null,null,null,null,null,null,null,null,null,null,null,null,null,null,null,null,null,null,null,null,null,null,null,null,null,"Mauritania"]
[null,null,null,null,null,null,null,null,null,null,null,null,null,null,null,null,null,null,null,null,null,null,null,null,null,null,null,null,null,null,"Mauritius"]
[null,null,null,null,null,null,null,null,null,null,null,null,null,null,null,null,null,null,null,null,null,null,null,null,null,null,null,null,null,null,"Mayotte"]
[null,null,null,null,null,null,null,null,null,null,null,null,null,null,null,null,null,null,null,null,null,null,null,null,null,null,null,null,null,null,"Mexico"]
[null,null,null,null,null,null,null,null,null,null,null,null,null,null,null,null,null,null,null,null,null,null,null,null,null,null,null,null,null,null,"Micronesia"]
[null,null,null,null,null,null,null,null,null,null,null,null,null,null,null,null,null,null,null,null,null,null,null,null,null,null,null,null,null,null,"Moldova"]
[null,null,null,null,null,null,null,null,null,null,null,null,null,null,null,null,null,null,null,null,null,null,null,null,null,null,null,null,null,null,"Monaco"]
[null,null,null,null,null,null,null,null,null,null,null,null,null,null,null,null,null,null,null,null,null,null,null,null,null,null,null,null,null,null,"Mongolia"]
[null,null,null,null,null,null,null,null,null,null,null,null,null,null,null,null,null,null,null,null,null,null,null,null,null,null,null,null,null,null,"Montenegro"]
[null,null,null,null,null,null,null,null,null,null,null,null,null,null,null,null,null,null,null,null,null,null,null,null,null,null,null,null,null,null,"Montserrat"]
[null,null,null,null,null,null,null,null,null,null,null,null,null,null,null,null,null,null,null,null,null,null,null,null,null,null,null,null,null,null,"Morocco"]
[null,null,null,null,null,null,null,null,null,null,null,null,null,null,null,null,null,null,null,null,null,null,null,null,null,null,null,null,null,null,"Mozambique"]
[null,null,null,null,null,null,null,null,null,null,null,null,null,null,null,null,null,null,null,null,null,null,null,null,null,null,null,null,null,null,"Myanmar"]
[null,null,null,null,null,null,null,null,null,null,null,null,null,null,null,null,null,null,null,null,null,null,null,null,null,null,null,null,null,null,"Namibia"]
[null,null,null,null,null,null,null,null,null,null,null,null,null,null,null,null,null,null,null,null,null,null,null,null,null,null,null,null,null,null,"Nauru"]
[null,null,null,null,null,null,null,null,null,null,null,null,null,null,null,null,null,null,null,null,null,null,null,null,null,null,null,null,null,null,"Nepal"]
[null,null,null,null,null,null,null,null,null,null,null,null,null,null,null,null,null,null,null,null,null,null,null,null,null,null,null,null,null,null,"Netherlands Antilles"]
[null,null,null,null,null,null,null,null,null,null,null,null,null,null,null,null,null,null,null,null,null,null,null,null,null,null,null,null,null,null,"Netherlands, The"]
[null,null,null,null,null,null,null,null,null,null,null,null,null,null,null,null,null,null,null,null,null,null,null,null,null,null,null,null,null,null,"New Caledonia"]
[null,null,null,null,null,null,null,null,null,null,null,null,null,null,null,null,null,null,null,null,null,null,null,null,null,null,null,null,null,null,"New Zealand"]
[null,null,null,null,null,null,null,null,null,null,null,null,null,null,null,null,null,null,null,null,null,null,null,null,null,null,null,null,null,null,"Nicaragua"]
[null,null,null,null,null,null,null,null,null,null,null,null,null,null,null,null,null,null,null,null,null,null,null,null,null,null,null,null,null,null,"Niger"]
[null,null,null,null,null,null,null,null,null,null,null,null,null,null,null,null,null,null,null,null,null,null,null,null,null,null,null,null,null,null,"Nigeria"]
[null,null,null,null,null,null,null,null,null,null,null,null,null,null,null,null,null,null,null,null,null,null,null,null,null,null,null,null,null,null,"Niue"]
[null,null,null,null,null,null,null,null,null,null,null,null,null,null,null,null,null,null,null,null,null,null,null,null,null,null,null,null,null,null,"Norfolk Island"]
[null,null,null,null,null,null,null,null,null,null,null,null,null,null,null,null,null,null,null,null,null,null,null,null,null,null,null,null,null,null,"Northern Mariana Islands"]
[null,null,null,null,null,null,null,null,null,null,null,null,null,null,null,null,null,null,null,null,null,null,null,null,null,null,null,null,null,null,"Norway"]
[null,null,null,null,null,null,null,null,null,null,null,null,null,null,null,null,null,null,null,null,null,null,null,null,null,null,null,null,null,null,"Oman"]
[null,null,null,null,null,null,null,null,null,null,null,null,null,null,null,null,null,null,null,null,null,null,null,null,null,null,null,null,null,null,"Pakistan"]
[null,null,null,null,null,null,null,null,null,null,null,null,null,null,null,null,null,null,null,null,null,null,null,null,null,null,null,null,null,null,"Palau"]
[null,null,null,null,null,null,null,null,null,null,null,null,null,null,null,null,null,null,null,null,null,null,null,null,null,null,null,null,null,null,"Palestinian Authority "]
[null,null,null,null,null,null,null,null,null,null,null,null,null,null,null,null,null,null,null,null,null,null,null,null,null,null,null,null,null,null,"Panama"]
[null,null,null,null,null,null,null,null,null,null,null,null,null,null,null,null,null,null,null,null,null,null,null,null,null,null,null,null,null,null,"Papua New Guinea"]
[null,null,null,null,null,null,null,null,null,null,null,null,null,null,null,null,null,null,null,null,null,null,null,null,null,null,null,null,null,null,"Paraguay"]
[null,null,null,null,null,null,null,null,null,null,null,null,null,null,null,null,null,null,null,null,null,null,null,null,null,null,null,null,null,null,"Peru"]
[null,null,null,null,null,null,null,null,null,null,null,null,null,null,null,null,null,null,null,null,null,null,null,null,null,null,null,null,null,null,"Philippines"]
[null,null,null,null,null,null,null,null,null,null,null,null,null,null,null,null,null,null,null,null,null,null,null,null,null,null,null,null,null,null,"Pitcairn Islands"]
[null,null,null,null,null,null,null,null,null,null,null,null,null,null,null,null,null,null,null,null,null,null,null,null,null,null,null,null,null,null,"Poland"]
[null,null,null,null,null,null,null,null,null,null,null,null,null,null,null,null,null,null,null,null,null,null,null,null,null,null,null,null,null,null,"Portugal"]
[null,null,null,null,null,null,null,null,null,null,null,null,null,null,null,null,null,null,null,null,null,null,null,null,null,null,null,null,null,null,"Puerto Rico"]
[null,null,null,null,null,null,null,null,null,null,null,null,null,null,null,null,null,null,null,null,null,null,null,null,null,null,null,null,null,null,"Qatar"]
[null,null,null,null,null,null,null,null,null,null,null,null,null,null,null,null,null,null,null,null,null,null,null,null,null,null,null,null,null,null,"Reunion"]
[null,null,null,null,null,null,null,null,null,null,null,null,null,null,null,null,null,null,null,null,null,null,null,null,null,null,null,null,null,null,"Romania"]
[null,null,null,null,null,null,null,null,null,null,null,null,null,null,null,null,null,null,null,null,null,null,null,null,null,null,null,null,null,null,"Russia"]
[null,null,null,null,null,null,null,null,null,null,null,null,null,null,null,null,null,null,null,null,null,null,null,null,null,null,null,null,null,null,"Rwanda"]
[null,null,null,null,null,null,null,null,null,null,null,null,null,null,null,null,null,null,null,null,null,null,null,null,null,null,null,null,null,null,"Saint Helena"]
[null,null,null,null,null,null,null,null,null,null,null,null,null,null,null,null,null,null,null,null,null,null,null,null,null,null,null,null,null,null,"Saint Kitts and Nevis"]
[null,null,null,null,null,null,null,null,null,null,null,null,null,null,null,null,null,null,null,null,null,null,null,null,null,null,null,null,null,null,"Saint Lucia"]
[null,null,null,null,null,null,null,null,null,null,null,null,null,null,null,null,null,null,null,null,null,null,null,null,null,null,null,null,null,null,"Saint Pierre and Miquelon"]
[null,null,null,null,null,null,null,null,null,null,null,null,null,null,null,null,null,null,null,null,null,null,null,null,null,null,null,null,null,null,"Saint Vincent and the Grenadines"]
[null,null,null,null,null,null,null,null,null,null,null,null,null,null,null,null,null,null,null,null,null,null,null,null,null,null,null,null,null,null,"Samoa"]
[null,null,null,null,null,null,null,null,null,null,null,null,null,null,null,null,null,null,null,null,null,null,null,null,null,null,null,null,null,null,"San Marino"]
[null,null,null,null,null,null,null,null,null,null,null,null,null,null,null,null,null,null,null,null,null,null,null,null,null,null,null,null,null,null,"Sao Tomé and Príncipe"]
[null,null,null,null,null,null,null,null,null,null,null,null,null,null,null,null,null,null,null,null,null,null,null,null,null,null,null,null,null,null,"Saudi Arabia"]
[null,null,null,null,null,null,null,null,null,null,null,null,null,null,null,null,null,null,null,null,null,null,null,null,null,null,null,null,null,null,"Senegal"]
[null,null,null,null,null,null,null,null,null,null,null,null,null,null,null,null,null,null,null,null,null,null,null,null,null,null,null,null,null,null,"Serbia"]
[null,null,null,null,null,null,null,null,null,null,null,null,null,null,null,null,null,null,null,null,null,null,null,null,null,null,null,null,null,null,"Seychelles"]
[null,null,null,null,null,null,null,null,null,null,null,null,null,null,null,null,null,null,null,null,null,null,null,null,null,null,null,null,null,null,"Sierra Leone"]
[null,null,null,null,null,null,null,null,null,null,null,null,null,null,null,null,null,null,null,null,null,null,null,null,null,null,null,null,null,null,"Singapore"]
[null,null,null,null,null,null,null,null,null,null,null,null,null,null,null,null,null,null,null,null,null,null,null,null,null,null,null,null,null,null,"Slovakia"]
[null,null,null,null,null,null,null,null,null,null,null,null,null,null,null,null,null,null,null,null,null,null,null,null,null,null,null,null,null,null,"Slovenia"]
[null,null,null,null,null,null,null,null,null,null,null,null,null,null,null,null,null,null,null,null,null,null,null,null,null,null,null,null,null,null,"Solomon Islands"]
[null,null,null,null,null,null,null,null,null,null,null,null,null,null,null,null,null,null,null,null,null,null,null,null,null,null,null,null,null,null,"Somalia"]
[null,null,null,null,null,null,null,null,null,null,null,null,null,null,null,null,null,null,null,null,null,null,null,null,null,null,null,null,null,null,"South Africa"]
[null,null,null,null,null,null,null,null,null,null,null,null,null,null,null,null,null,null,null,null,null,null,null,null,null,null,null,null,null,null,"South Georgia and the South Sandwich Islands"]
[null,null,null,null,null,null,null,null,null,null,null,null,null,null,null,null,null,null,null,null,null,null,null,null,null,null,null,null,null,null,"Spain"]
[null,null,null,null,null,null,null,null,null,null,null,null,null,null,null,null,null,null,null,null,null,null,null,null,null,null,null,null,null,null,"Sri Lanka"]
[null,null,null,null,null,null,null,null,null,null,null,null,null,null,null,null,null,null,null,null,null,null,null,null,null,null,null,null,null,null,"Sudan"]
[null,null,null,null,null,null,null,null,null,null,null,null,null,null,null,null,null,null,null,null,null,null,null,null,null,null,null,null,null,null,"Suriname"]
[null,null,null,null,null,null,null,null,null,null,null,null,null,null,null,null,null,null,null,null,null,null,null,null,null,null,null,null,null,null,"Svalbard"]
[null,null,null,null,null,null,null,null,null,null,null,null,null,null,null,null,null,null,null,null,null,null,null,null,null,null,null,null,null,null,"Swaziland"]
[null,null,null,null,null,null,null,null,null,null,null,null,null,null,null,null,null,null,null,null,null,null,null,null,null,null,null,null,null,null,"Sweden"]
[null,null,null,null,null,null,null,null,null,null,null,null,null,null,null,null,null,null,null,null,null,null,null,null,null,null,null,null,null,null,"Switzerland"]
[null,null,null,null,null,null,null,null,null,null,null,null,null,null,null,null,null,null,null,null,null,null,null,null,null,null,null,null,null,null,"Syria"]
[null,null,null,null,null,null,null,null,null,null,null,null,null,null,null,null,null,null,null,null,null,null,null,null,null,null,null,null,null,null,"Taiwan",null,null,null,null,null,null,null,null,null,null,null,null,null,null,null,null,null,null,null,null,null,null,null,null,null,null,null,null,null,null,null,null,null,null,null,null,null,null,"Click Here to get back to Order Coversheet",null,null,null,null,null,null,null,null,null,null,null,null,null,null,null,null,null,null,null,null,null,null,null,null,null,null,null,null,null,null,null,null,null,null,null,null,null,null,null,null,null,null,null,null,"Click here to get back to the Coversheet"]
[null,null,null,null,null,null,null,null,null,null,null,null,null,null,null,null,null,null,null,null,null,null,null,null,null,null,null,null,null,null,"Tajikistan",null,null,null,null,null,null,null,null,null,null,null,null,null,null,null,null,null,null,null,null,null,null,null,null,null,null,null,null,null,null,null,null,null,null,null,null,null,null,"TABLE No.",null,null,"FORM No. ",null,null,"PAGE No. ",null,null,"REPORT No.",null,null,"DATAPORT No.",null,null,"CODEUNIT No.",null,null,"XML Port No.",null,null,null,null,null,null,null,null,null,null,null,null,null,null,null,null,null,null,null,null,null,null,null,null,null,null,null,"SQL/MOSS Media Pricelist"]
[null,null,null,null,null,null,null,null,null,null,null,null,null,null,null,null,null,null,null,null,null,null,null,null,null,null,null,null,null,null,"Tanzania",null,null,null,null,null,null,null,null,null,null,null,null,null,null,null,null,null,null,null,null,null,null,null,null,null,null,null,null,null,null,null,null,null,null,null,null,null,null,"From","To","#","From","To","#","From","To","#","From","To","#","From","To","#","From","To","#","From","To","#",null,null,null,null,null,null,null,null,null,null,null,null,null,null,null,null,null,null,null,null,null,null,null,null,"EOC"]
[null,null,null,null,null,null,null,null,null,null,null,null,null,null,null,null,null,null,null,null,null,null,null,null,null,null,null,null,null,null,"Thailand",null,null,null,null,null,null,null,null,null,null,null,null,null,null,null,null,null,null,null,null,null,null,null,null,null,null,null,null,null,null,null,null,null,null,null,null,null,null,null,null,{"$f":"IF(BS215=BR215,IF(BR215=0,\"\",1),IF(BR215>BS215,IF(BS215=0,1,\"error\"),BS215-BR215+1))","v":""},null,null,{"$f":"IF(BV215=BU215,IF(BU215=0,\"\",1),IF(BU215>BV215,IF(BV215=0,1,\"error\"),BV215-BU215+1))","v":""},null,null,{"$f":"IF(BY215=BX215,IF(BX215=0,\"\",1),IF(BX215>BY215,IF(BY215=0,1,\"error\"),BY215-BX215+1))","v":""},null,null,{"$f":"IF(CB215=CA215,IF(CA215=0,\"\",1),IF(CA215>CB215,IF(CB215=0,1,\"error\"),CB215-CA215+1))","v":""},null,null,{"$f":"IF(CE215=CD215,IF(CD215=0,\"\",1),IF(CD215>CE215,IF(CE215=0,1,\"error\"),CE215-CD215+1))","v":""},null,null,{"$f":"IF(CH215=CG215,IF(CG215=0,\"\",1),IF(CG215>CH215,IF(CH215=0,1,\"error\"),CH215-CG215+1))","v":""},null,null,{"$f":"IF(CK215=CJ215,IF(CJ215=0,\"\",1),IF(CJ215>CK215,IF(CK215=0,1,\"error\"),CK215-CJ215+1))","v":""},null,null,null,null,null,null,null,null,null,null,null,null,null,null,null,null,null,null,null,null,null,null,null,null,"SQL 2005","Description","Please check if required (X)"]
[null,null,null,null,null,null,null,null,null,null,null,null,null,null,null,null,null,null,null,null,null,null,null,null,null,null,null,null,null,null,"Timor-Leste",null,null,null,null,null,null,null,null,null,null,null,null,null,null,null,null,null,null,null,null,null,null,null,null,null,null,null,null,null,null,null,null,null,null,null,null,null,null,null,null,"",null,null,{"$f":"IF(BV216=BU216,IF(BU216=0,\"\",1),IF(BU216>BV216,IF(BV216=0,1,\"error\"),BV216-BU216+1))","v":""},null,null,{"$f":"IF(BY216=BX216,IF(BX216=0,\"\",1),IF(BX216>BY216,IF(BY216=0,1,\"error\"),BY216-BX216+1))","v":""},null,null,"",null,null,"",null,null,"",null,null,"",null,null,null,null,null,null,null,null,null,null,null,null,null,null,null,null,null,null,null,null,null,null,null,null,108058053,"English Standard MS SQL2005 CD"]
[null,null,null,null,null,null,null,null,null,null,null,null,null,null,null,null,null,null,null,null,null,null,null,null,null,null,null,null,null,null,"Togo",null,null,null,null,null,null,null,null,null,null,null,null,null,null,null,null,null,null,null,null,null,null,null,null,null,null,null,null,null,null,null,null,null,null,null,null,null,null,null,null,"",null,null,{"$f":"IF(BV217=BU217,IF(BU217=0,\"\",1),IF(BU217>BV217,IF(BV217=0,1,\"error\"),BV217-BU217+1))","v":""},null,null,{"$f":"IF(BY217=BX217,IF(BX217=0,\"\",1),IF(BX217>BY217,IF(BY217=0,1,\"error\"),BY217-BX217+1))","v":""},null,null,"",null,null,"",null,null,"",null,null,"",null,null,null,null,null,null,null,null,null,null,null,null,null,null,null,null,null,null,null,null,null,null,null,null,108077216,"English Enterprise MS SQL2005 CD"]
[null,null,null,null,null,null,null,null,null,null,null,null,null,null,null,null,null,null,null,null,null,null,null,null,null,null,null,null,null,null,"Tokelau",null,null,null,null,null,null,null,null,null,null,null,null,null,null,null,null,null,null,null,null,null,null,null,null,null,null,null,null,null,null,null,null,null,null,null,null,null,null,null,null,"",null,null,null,null,null,null,null,null,"",null,null,"",null,null,"",null,null,"",null,null,null,null,null,null,null,null,null,null,null,null,null,null,null,null,null,null,null,null,null,null,null,null,108043471,"French Standard MS SQL2005 CD"]
[null,null,null,null,null,null,null,null,null,null,null,null,null,null,null,null,null,null,null,null,null,null,null,null,null,null,null,null,null,null,"Tonga",null,null,null,null,null,null,null,null,null,null,null,null,null,null,null,null,null,null,null,null,null,null,null,null,null,null,null,null,null,null,null,null,null,null,null,null,null,null,null,null,"",null,null,null,null,null,null,null,null,"",null,null,"",null,null,"",null,null,"",null,null,null,null,null,null,null,null,null,null,null,null,null,null,null,null,null,null,null,null,null,null,null,null,108043479,"French Enterprise MS SQL2005 CD"]
[null,null,null,null,null,null,null,null,null,null,null,null,null,null,null,null,null,null,null,null,null,null,null,null,null,null,null,null,null,null,"Trinidad and Tobago",null,null,null,null,null,null,null,null,null,null,null,null,null,null,null,null,null,null,null,null,null,null,null,null,null,null,null,null,null,null,null,null,null,null,null,null,null,null,null,null,"",null,null,null,null,null,null,null,null,"",null,null,"",null,null,"",null,null,"",null,null,null,null,null,null,null,null,null,null,null,null,null,null,null,null,null,null,null,null,null,null,null,null,108043472,"German Standard MS SQL2005 CD"]
[null,null,null,null,null,null,null,null,null,null,null,null,null,null,null,null,null,null,null,null,null,null,null,null,null,null,null,null,null,null,"Tunisia",null,null,null,null,null,null,null,null,null,null,null,null,null,null,null,null,null,null,null,null,null,null,null,null,null,null,null,null,null,null,null,null,null,null,null,null,null,null,null,null,"",null,null,null,null,null,null,null,null,"",null,null,"",null,null,"",null,null,"",null,null,null,null,null,null,null,null,null,null,null,null,null,null,null,null,null,null,null,null,null,null,null,null,108043476,"German Enterprise MS SQL2005 CD"]
[null,null,null,null,null,null,null,null,null,null,null,null,null,null,null,null,null,null,null,null,null,null,null,null,null,null,null,null,null,null,"Turkey",null,null,null,null,null,null,null,null,null,null,null,null,null,null,null,null,null,null,null,null,null,null,null,null,null,null,null,null,null,null,null,null,null,null,null,null,null,null,null,null,"",null,null,{"$f":"IF(BV222=BU222,IF(BU222=0,\"\",1),IF(BU222>BV222,IF(BV222=0,1,\"error\"),BV222-BU222+1))","v":""},null,null,{"$f":"IF(BY222=BX222,IF(BX222=0,\"\",1),IF(BX222>BY222,IF(BY222=0,1,\"error\"),BY222-BX222+1))","v":""},null,null,"",null,null,"",null,null,"",null,null,"",null,null,null,null,null,null,null,null,null,null,null,null,null,null,null,null,null,null,null,null,null,null,null,null,108043474,"Italian Standard MS SQL2005 CD"]
[null,null,null,null,null,null,null,null,null,null,null,null,null,null,null,null,null,null,null,null,null,null,null,null,null,null,null,null,null,null,"Turkmenistan",null,null,null,null,null,null,null,null,null,null,null,null,null,null,null,null,null,null,null,null,null,null,null,null,null,null,null,null,null,null,null,null,null,null,null,null,null,null,null,null,"",null,null,"",null,null,"",null,null,"",null,null,"",null,null,"",null,null,"",null,null,null,null,null,null,null,null,null,null,null,null,null,null,null,null,null,null,null,null,null,null,null,null,108043478,"Italian Enterprise MS SQL2005 CD"]
[null,null,null,null,null,null,null,null,null,null,null,null,null,null,null,null,null,null,null,null,null,null,null,null,null,null,null,null,null,null,"Turks and Caicos Islands",null,null,null,null,null,null,null,null,null,null,null,null,null,null,null,null,null,null,null,null,null,null,null,null,null,null,null,null,null,null,null,null,null,null,null,null,null,null,null,null,"",null,null,"",null,null,"",null,null,"",null,null,"",null,null,"",null,null,"",null,null,null,null,null,null,null,null,null,null,null,null,null,null,null,null,null,null,null,null,null,null,null,null,108076423,"Spanish Standard MS SQL2005 CD"]
[null,null,null,null,null,null,null,null,null,null,null,null,null,null,null,null,null,null,null,null,null,null,null,null,null,null,null,null,null,null,"Tuvalu",null,null,null,null,null,null,null,null,null,null,null,null,null,null,null,null,null,null,null,null,null,null,null,null,null,null,null,null,null,null,null,null,null,null,null,null,null,null,null,null,"",null,null,"",null,null,"",null,null,"",null,null,"",null,null,"",null,null,"",null,null,null,null,null,null,null,null,null,null,null,null,null,null,null,null,null,null,null,null,null,null,null,null,108020633,"Spanish Enterprise MS SQL2005 CD"]
[null,null,null,null,null,null,null,null,null,null,null,null,null,null,null,null,null,null,null,null,null,null,null,null,null,null,null,null,null,null,"U.S. Minor Outlying Islands",null,null,null,null,null,null,null,null,null,null,null,null,null,null,null,null,null,null,null,null,null,null,null,null,null,null,null,null,null,null,null,null,null,null,null,null,null,null,null,null,"",null,null,"",null,null,"",null,null,"",null,null,"",null,null,"",null,null,"",null,null,null,null,null,null,null,null,null,null,null,null,null,null,null,null,null,null,null,null,null,null,null,null,"SQL 2008",null," Please check if required (X)"]
[null,null,null,null,null,null,null,null,null,null,null,null,null,null,null,null,null,null,null,null,null,null,null,null,null,null,null,null,null,null,"Uganda",null,null,null,null,null,null,null,null,null,null,null,null,null,null,null,null,null,null,null,null,null,null,null,null,null,null,null,null,null,null,null,null,null,null,null,null,null,null,null,null,"",null,null,"",null,null,"",null,null,"",null,null,"",null,null,"",null,null,"",null,null,null,null,null,null,null,null,null,null,null,null,null,null,null,null,null,null,null,null,null,null,null,null,109003144,"English Standard MS SQL2008 DVD"]
[null,null,null,null,null,null,null,null,null,null,null,null,null,null,null,null,null,null,null,null,null,null,null,null,null,null,null,null,null,null,"Ukraine",null,null,null,null,null,null,null,null,null,null,null,null,null,null,null,null,null,null,null,null,null,null,null,null,null,null,null,null,null,null,null,null,null,null,null,null,null,null,null,null,"",null,null,"",null,null,"",null,null,"",null,null,"",null,null,"",null,null,"",null,null,null,null,null,null,null,null,null,null,null,null,null,null,null,null,null,null,null,null,null,null,null,null,109003143,"English Enterprise MS SQL2008 DVD"]
[null,null,null,null,null,null,null,null,null,null,null,null,null,null,null,null,null,null,null,null,null,null,null,null,null,null,null,null,null,null,"United Arab Emirates",null,null,null,null,null,null,null,null,null,null,null,null,null,null,null,null,null,null,null,null,null,null,null,null,null,null,null,null,null,null,null,null,null,null,null,null,null,null,null,null,"",null,null,"",null,null,"",null,null,"",null,null,"",null,null,"",null,null,"",null,null,null,null,null,null,null,null,null,null,null,null,null,null,null,null,null,null,null,null,null,null,null,null,109040998,"Italian Standard MS SQL2008 DVD"]
[null,null,null,null,null,null,null,null,null,null,null,null,null,null,null,null,null,null,null,null,null,null,null,null,null,null,null,null,null,null,"United Kingdom",null,null,null,null,null,null,null,null,null,null,null,null,null,null,null,null,null,null,null,null,null,null,null,null,null,null,null,null,null,null,null,null,null,null,null,null,null,null,null,null,"",null,null,"",null,null,"",null,null,"",null,null,"",null,null,"",null,null,"",null,null,null,null,null,null,null,null,null,null,null,null,null,null,null,null,null,null,null,null,null,null,null,null,109040997,"Italian Enterprise MS SQL2008 DVD"]
[null,null,null,null,null,null,null,null,null,null,null,null,null,null,null,null,null,null,null,null,null,null,null,null,null,null,null,null,null,null,"United States",null,null,null,null,null,null,null,null,null,null,null,null,null,null,null,null,null,null,null,null,null,null,null,null,null,null,null,null,null,null,null,null,null,null,null,null,null,null,null,null,"",null,null,"",null,null,"",null,null,"",null,null,"",null,null,"",null,null,"",null,null,null,null,null,null,null,null,null,null,null,null,null,null,null,null,null,null,null,null,null,null,null,null,109040994,"French Standard MS SQL2008 DVD"]
[null,null,null,null,null,null,null,null,null,null,null,null,null,null,null,null,null,null,null,null,null,null,null,null,null,null,null,null,null,null,"Uruguay",null,null,null,null,null,null,null,null,null,null,null,null,null,null,null,null,null,null,null,null,null,null,null,null,null,null,null,null,null,null,null,null,null,null,null,null,null,null,null,null,"",null,null,"",null,null,"",null,null,"",null,null,"",null,null,"",null,null,"",null,null,null,null,null,null,null,null,null,null,null,null,null,null,null,null,null,null,null,null,null,null,null,null,109040993,"French Enterprise MS SQL2008 DVD"]
[null,null,null,null,null,null,null,null,null,null,null,null,null,null,null,null,null,null,null,null,null,null,null,null,null,null,null,null,null,null,"Uzbekistan",null,null,null,null,null,null,null,null,null,null,null,null,null,null,null,null,null,null,null,null,null,null,null,null,null,null,null,null,null,null,null,null,null,null,null,null,null,null,null,null,"",null,null,"",null,null,"",null,null,"",null,null,"",null,null,"",null,null,"",null,null,null,null,null,null,null,null,null,null,null,null,null,null,null,null,null,null,null,null,null,null,null,null,109003146,"Spanish Enterprise MS SQL2008 DVD"]
[null,null,null,null,null,null,null,null,null,null,null,null,null,null,null,null,null,null,null,null,null,null,null,null,null,null,null,null,null,null,"Vanuatu",null,null,null,null,null,null,null,null,null,null,null,null,null,null,null,null,null,null,null,null,null,null,null,null,null,null,null,null,null,null,null,null,null,null,null,null,null,null,null,null,"",null,null,"",null,null,"",null,null,"",null,null,"",null,null,"",null,null,"",null,null,null,null,null,null,null,null,null,null,null,null,null,null,null,null,null,null,null,null,null,null,null,null,109003145,"Spanish Standard MS SQL2008 DVD"]
[null,null,null,null,null,null,null,null,null,null,null,null,null,null,null,null,null,null,null,null,null,null,null,null,null,null,null,null,null,null,"Vatican City",null,null,null,null,null,null,null,null,null,null,null,null,null,null,null,null,null,null,null,null,null,null,null,null,null,null,null,null,null,null,null,null,null,null,null,null,null,null,null,null,"",null,null,"",null,null,"",null,null,"",null,null,"",null,null,"",null,null,"",null,null,null,null,null,null,null,null,null,null,null,null,null,null,null,null,null,null,null,null,null,null,null,null,109040995,"German Standard MS SQL2008 DVD"]
[null,null,null,null,null,null,null,null,null,null,null,null,null,null,null,null,null,null,null,null,null,null,null,null,null,null,null,null,null,null,"Venezuela",null,null,null,null,null,null,null,null,null,null,null,null,null,null,null,null,null,null,null,null,null,null,null,null,null,null,null,null,null,null,null,null,null,null,null,null,null,null,null,null,"",null,null,"",null,null,"",null,null,"",null,null,"",null,null,"",null,null,"",null,null,null,null,null,null,null,null,null,null,null,null,null,null,null,null,null,null,null,null,null,null,null,null,109040996,"German Enterprise MS SQL2008 DVD"]
[null,null,null,null,null,null,null,null,null,null,null,null,null,null,null,null,null,null,null,null,null,null,null,null,null,null,null,null,null,null,"Vietnam",null,null,null,null,null,null,null,null,null,null,null,null,null,null,null,null,null,null,null,null,null,null,null,null,null,null,null,null,null,null,null,null,null,null,null,null,null,null,null,null,"",null,null,"",null,null,"",null,null,"",null,null,"",null,null,"",null,null,"",null,null,null,null,null,null,null,null,null,null,null,null,null,null,null,null,null,null,null,null,null,null,null,null,"SQL 2008 R2",null,"Please check if required (X)"]
[null,null,null,null,null,null,null,null,null,null,null,null,null,null,null,null,null,null,null,null,null,null,null,null,null,null,null,null,null,null,"Virgin Islands, British",null,null,null,null,null,null,null,null,null,null,null,null,null,null,null,null,null,null,null,null,null,null,null,null,null,null,null,null,null,null,null,null,null,null,null,null,null,null,null,null,"",null,null,"",null,null,"",null,null,"",null,null,"",null,null,"",null,null,"",null,null,null,null,null,null,null,null,null,null,null,null,null,null,null,null,null,null,null,null,null,null,null,null,109059965,"English Standard MS SQL2008  R2 DVD"]
[null,null,null,null,null,null,null,null,null,null,null,null,null,null,null,null,null,null,null,null,null,null,null,null,null,null,null,null,null,null,"Virgin Islands, U.S.",null,null,null,null,null,null,null,null,null,null,null,null,null,null,null,null,null,null,null,null,null,null,null,null,null,null,null,null,null,null,null,null,null,null,null,null,null,null,null,null,"",null,null,"",null,null,"",null,null,"",null,null,"",null,null,"",null,null,"",null,null,null,null,null,null,null,null,null,null,null,null,null,null,null,null,null,null,null,null,null,null,null,null,109059961,"English Enterprise MS SQL2008 R2 DVD"]
[null,null,null,null,null,null,null,null,null,null,null,null,null,null,null,null,null,null,null,null,null,null,null,null,null,null,null,null,null,null,"Wallis and Futuna",null,null,null,null,null,null,null,null,null,null,null,null,null,null,null,null,null,null,null,null,null,null,null,null,null,null,null,null,null,null,null,null,null,null,null,null,null,null,null,null,"",null,null,"",null,null,"",null,null,"",null,null,"",null,null,"",null,null,"",null,null,null,null,null,null,null,null,null,null,null,null,null,null,null,null,null,null,null,null,null,null,null,null,109059972,"Spanish Standard MS SQL2008 R2 DVD"]
[null,null,null,null,null,null,null,null,null,null,null,null,null,null,null,null,null,null,null,null,null,null,null,null,null,null,null,null,null,null,"Western Sahara",null,null,null,null,null,null,null,null,null,null,null,null,null,null,null,null,null,null,null,null,null,null,null,null,null,null,null,null,null,null,null,null,null,null,null,null,null,null,null,null,"",null,null,"",null,null,"",null,null,"",null,null,"",null,null,"",null,null,"",null,null,null,null,null,null,null,null,null,null,null,null,null,null,null,null,null,null,null,null,null,null,null,null,109059973,"Spanish Enterprise MS SQL2008 R2 DVD"]
[null,null,null,null,null,null,null,null,null,null,null,null,null,null,null,null,null,null,null,null,null,null,null,null,null,null,null,null,null,null,"Yemen",null,null,null,null,null,null,null,null,null,null,null,null,null,null,null,null,null,null,null,null,null,null,null,null,null,null,null,null,null,null,null,null,null,null,null,null,null,null,null,null,"",null,null,"",null,null,"",null,null,"",null,null,"",null,null,"",null,null,"",null,null,null,null,null,null,null,null,null,null,null,null,null,null,null,null,null,null,null,null,null,null,null,null,109059975,"French Standard MS SQL2008 R2 DVD"]
[null,null,null,null,null,null,null,null,null,null,null,null,null,null,null,null,null,null,null,null,null,null,null,null,null,null,null,null,null,null,"Zambia",null,null,null,null,null,null,null,null,null,null,null,null,null,null,null,null,null,null,null,null,null,null,null,null,null,null,null,null,null,null,null,null,null,null,null,null,null,null,null,null,"",null,null,"",null,null,"",null,null,"",null,null,"",null,null,"",null,null,"",null,null,null,null,null,null,null,null,null,null,null,null,null,null,null,null,null,null,null,null,null,null,null,null,109057774,"French Enterprise MS SQL2008 R2 DVD"]
[null,null,null,null,null,null,null,null,null,null,null,null,null,null,null,null,null,null,null,null,null,null,null,null,null,null,null,null,null,null,"Zimbabwe",null,null,null,null,null,null,null,null,null,null,null,null,null,null,null,null,null,null,null,null,null,null,null,null,null,null,null,null,null,null,null,null,null,null,null,null,null,null,null,null,"",null,null,"",null,null,"",null,null,"",null,null,"",null,null,"",null,null,"",null,null,null,null,null,null,null,null,null,null,null,null,null,null,null,null,null,null,null,null,null,null,null,null,109059976,"German Standard MS SQL2008 R2 DVD"]
[null,null,null,null,null,null,null,null,null,null,null,null,null,null,null,null,null,null,null,null,null,null,null,null,null,null,null,null,null,null,null,null,null,null,null,null,null,null,null,null,null,null,null,null,null,null,null,null,null,null,null,null,null,null,null,null,null,null,null,null,null,null,null,null,null,null,null,null,null,null,null,"",null,null,"",null,null,"",null,null,"",null,null,"",null,null,"",null,null,"",null,null,null,null,null,null,null,null,null,null,null,null,null,null,null,null,null,null,null,null,null,null,null,null,109059977,"German Enterprise MS SQL2008 R2 DVD"]
[null,null,null,null,null,null,null,null,null,null,null,null,null,null,null,null,null,null,null,null,null,null,null,null,null,null,null,null,null,null,null,null,null,null,null,null,null,null,null,null,null,null,null,null,null,null,null,null,null,null,null,null,null,null,null,null,null,null,null,null,null,null,null,null,null,null,null,null,null,null,null,"",null,null,"",null,null,"",null,null,"",null,null,"",null,null,"",null,null,"",null,null,null,null,null,null,null,null,null,null,null,null,null,null,null,null,null,null,null,null,null,null,null,null,109059979,"Italian Standard MS SQL2008 R2 DVD"]
[null,null,null,null,null,null,null,null,null,null,null,null,null,null,null,null,null,null,null,null,null,null,null,null,null,null,null,null,null,null,null,null,null,null,null,null,null,null,null,null,null,null,null,null,null,null,null,null,null,null,null,null,null,null,null,null,null,null,null,null,null,null,null,null,null,null,null,null,null,null,null,"",null,null,"",null,null,"",null,null,"",null,null,"",null,null,"",null,null,"",null,null,null,null,null,null,null,null,null,null,null,null,null,null,null,null,null,null,null,null,null,null,null,null,109059978,"Italian Enterprise MS SQL2008 R2 DVD"]
[null,null,null,null,null,null,null,null,null,null,null,null,null,null,null,null,null,null,null,null,null,null,null,null,null,null,null,null,null,null,null,null,null,null,null,null,null,null,null,null,null,null,null,null,null,null,null,null,null,null,null,null,null,null,null,null,null,null,null,null,null,null,null,null,null,null,null,null,null,null,"TOTAL Tables",{"$f":"SUM(BT215:BT247)","v":0},null,"TOTAL Forms",{"$f":"SUM(BW215:BW247)","v":0},null,"TOTAL Pages",{"$f":"SUM(BZ215:BZ247)","v":0},null,"TOTAL Reports",{"$f":"SUM(CC215:CC247)","v":0},null,"TOTAL Dataports",{"$f":"SUM(CF215:CF247)","v":0},null,"TOTAL Codeunits",{"$f":"SUM(CI215:CI247)","v":0},null,"TOTAL Codeunits",{"$f":"SUM(CL215:CL247)","v":0},null,null,null,null,null,null,null,null,null,null,null,null,null,null,null,null,null,null,null,null,null,null,null,null,"Microsoft Office Sharepoint Server  (MOSS) 2007",null,"Please check if required (X)"]
[null,null,null,null,null,null,null,null,null,null,null,null,null,null,null,null,null,null,null,null,null,null,null,null,null,null,null,null,null,null,null,null,null,null,null,null,null,null,null,null,null,null,null,null,null,null,null,null,null,null,null,null,null,null,null,null,null,null,null,null,null,null,null,null,null,null,null,null,null,null,null,null,null,null,null,null,null,null,null,null,null,null,null,null,null,null,null,null,null,null,null,null,null,null,null,null,null,null,null,null,null,null,null,null,null,null,null,null,null,null,null,null,null,null,108057839,"Spanish Office SharePoint Server DVD"]
[null,null,null,null,null,null,null,null,null,null,null,null,null,null,null,null,null,null,null,null,null,null,null,null,null,null,null,null,null,null,null,null,null,null,null,null,null,null,null,null,null,null,null,null,null,null,null,null,null,null,null,null,null,null,null,null,null,null,null,null,null,null,null,null,null,null,null,null,null,null,null,null,null,null,null,null,null,null,null,null,null,null,null,null,null,null,null,null,null,null,null,null,null,null,null,null,null,null,null,null,null,null,null,null,null,null,null,null,null,null,null,null,null,null,108022830,"Danish Office SharePoint Server DVD"]
[null,null,null,null,null,null,null,null,null,null,null,null,null,null,null,null,null,null,null,null,null,null,null,null,null,null,null,null,null,null,null,null,null,null,null,null,null,null,null,null,null,null,null,null,null,null,null,null,null,null,null,null,null,null,null,null,null,null,null,null,null,null,null,null,null,null,null,null,null,null,null,null,null,null,null,null,null,null,null,null,null,null,null,null,null,null,null,null,null,null,null,null,null,null,null,null,null,null,null,null,null,null,null,null,null,null,null,null,null,null,null,null,null,null,108022828,"German Office SharePoint Server DVD"]
[null,null,null,null,null,null,null,null,null,null,null,null,null,null,null,null,null,null,null,null,null,null,null,null,null,null,null,null,null,null,null,null,null,null,null,null,null,null,null,null,null,null,null,null,null,null,null,null,null,null,null,null,null,null,null,null,null,null,null,null,null,null,null,null,null,null,null,null,null,null,null,null,null,null,null,null,null,null,null,null,null,null,null,null,null,null,null,null,null,null,null,null,null,null,null,null,null,null,null,null,null,null,null,null,null,null,null,null,null,null,null,null,null,null,108022827,"Italian Office SharePoint Server DVD"]
[null,null,null,null,null,null,null,null,null,null,null,null,null,null,null,null,null,null,null,null,null,null,null,null,null,null,null,null,null,null,null,null,null,null,null,null,null,null,null,null,null,null,null,null,null,null,null,null,null,null,null,null,null,null,null,null,null,null,null,null,null,null,null,null,null,null,null,null,null,null,null,null,null,null,null,null,null,null,null,null,null,null,null,null,null,null,null,null,null,null,null,null,null,null,null,null,null,null,null,null,null,null,null,null,null,null,null,null,null,null,null,null,null,null,108022475,"French Office SharePoint Server DVD"]
[null,null,null,null,null,null,null,null,null,null,null,null,null,null,null,null,null,null,null,null,null,null,null,null,null,null,null,null,null,null,null,null,null,null,null,null,null,null,null,null,null,null,null,null,null,null,null,null,null,null,null,null,null,null,null,null,null,null,null,null,null,null,null,null,null,null,null,null,null,null,null,null,null,null,null,null,null,null,null,null,null,null,null,null,null,null,null,null,null,null,null,null,null,null,null,null,null,null,null,null,null,null,null,null,null,null,null,null,null,null,null,null,null,null,108019164,"English Office SharePoint Server DVD"]

{"sheet":"Dynamics GP","index":3,"n_rows":43,"n_cols":9,"rows_kept":43,"cut":false,"hidden":false,"merged":[[13,1,13,4],[42,0,42,6],[28,3,28,4],[22,3,22,4],[36,1,36,4],[38,1,38,4],[40,1,40,5],[41,1,41,5]]}
["Microsoft Dynamics GP 2013 Perpetual Licensing Model Price List"]
[]
["Customer Location:",null,null,null,null,{"$f":"'GP Master Calc'!E5","v":"Price List – Effective April, 2013"}]
[null,null,null,null,null,"Microsoft Confidential"]
[null,null,null,null,null,"Total Value","** Localization Disclaimer **"]
[null,null,null,null,null,{"$f":"'GP Master Calc'!F8","v":13456}]
[{"$f":"IF('GP Master Calc'!A9=\"\",\"\",'GP Master Calc'!A9)","v":"Qty"},{"$f":"IF('GP Master Calc'!B9=\"\",\"\",'GP Master Calc'!B9)","v":"Item"},{"$f":"IF('GP Master Calc'!C9=\"\",\"\",'GP Master Calc'!C9)","v":"Notes"},{"$f":"IF('GP Master Calc'!D9=\"\",\"\",'GP Master Calc'!D9)","v":"SKU"},{"$f":"IF('GP Master Calc'!E9=\"\",\"\",'GP Master Calc'!E9)","v":"USD"},{"$f":"IF('GP Master Calc'!F9=\"\",\"\",'GP Master Calc'!F9)","v":"Total"},{"$f":"IF('GP Master Calc'!G9=\"\",\"\",'GP Master Calc'!G9)","v":"Prerequisites"},null,"Status"]
[null,{"$f":"IF('GP Master Calc'!B10=\"\",\"\",'GP Master Calc'!B10)","v":"ERP Solution Suite "},{"$f":"IF('GP Master Calc'!C10=\"\",\"\",'GP Master Calc'!C10)","v":""},{"$f":"IF('GP Master Calc'!D10=\"\",\"\",'GP Master Calc'!D10)","v":""},{"$f":"IF('GP Master Calc'!E10=\"\",\"\",'GP Master Calc'!E10)","v":""},{"$f":"IF('GP Master Calc'!F10=\"\",\"\",'GP Master Calc'!F10)","v":""},{"$f":"IF('GP Master Calc'!G10=\"\",\"\",'GP Master Calc'!G10)","v":""},null,{"$f":"'GP Master Calc'!J10","v":"Included"}]
[1,{"$f":"IF('GP Master Calc'!B11=\"\",\"\",'GP Master Calc'!B11)","v":"Starter Pack"},{"$f":"IF('GP Master Calc'!C11=\"\",\"\",'GP Master Calc'!C11)","v":""},{"$f":"IF('GP Master Calc'!D11=\"\",\"\",'GP Master Calc'!D11)","v":109098612},{"$f":"IF('GP Master Calc'!E11=\"\",\"\",'GP Master Calc'!E11)","v":5000},{"$f":"IF('GP Master Calc'!F11=\"\",\"\",'GP Master Calc'!F11)","v":5000},{"$f":"IF('GP Master Calc'!G11=\"\",\"\",'GP Master Calc'!G11)","v":"Starter Pack is the prerequisite for all items on price list"},null,{"$f":"'GP Master Calc'!J11","v":"Included"}]
[0,{"$f":"IF('GP Master Calc'!B12=\"\",\"\",'GP Master Calc'!B12)","v":"Extended Pack"},{"$f":"IF('GP Master Calc'!C12=\"\",\"\",'GP Master Calc'!C12)","v":""},{"$f":"IF('GP Master Calc'!D12=\"\",\"\",'GP Master Calc'!D12)","v":109098613},{"$f":"IF('GP Master Calc'!E12=\"\",\"\",'GP Master Calc'!E12)","v":10000},{"$f":"IF('GP Master Calc'!F12=\"\",\"\",'GP Master Calc'!F12)","v":0},{"$f":"IF('GP Master Calc'!G12=\"\",\"\",'GP Master Calc'!G12)","v":""},null,{"$f":"'GP Master Calc'!J12","v":"Included"}]
[null,{"$f":"IF('GP Master Calc'!B13=\"\",\"\",'GP Master Calc'!B13)","v":"Users"},{"$f":"IF('GP Master Calc'!C13=\"\",\"\",'GP Master Calc'!C13)","v":""},{"$f":"IF('GP Master Calc'!D13=\"\",\"\",'GP Master Calc'!D13)","v":""},{"$f":"IF('GP Master Calc'!E13=\"\",\"\",'GP Master Calc'!E13)","v":""},{"$f":"IF('GP Master Calc'!F13=\"\",\"\",'GP Master Calc'!F13)","v":""},{"$f":"IF('GP Master Calc'!G13=\"\",\"\",'GP Master Calc'!G13)","v":""},null,{"$f":"'GP Master Calc'!J13","v":"Included"}]
[1,{"$f":"IF('GP Master Calc'!B14=\"\",\"\",'GP Master Calc'!B14)","v":"Full User CAL (Concurrent User)"},{"$f":"IF('GP Master Calc'!C15=\"\",\"\",'GP Master Calc'!C15)","v":""},{"$f":"IF('GP Master Calc'!D14=\"\",\"\",'GP Master Calc'!D14)","v":109098614},{"$f":"IF('GP Master Calc'!E14=\"\",\"\",'GP Master Calc'!E14)","v":3000},{"$f":"IF('GP Master Calc'!F14=\"\",\"\",'GP Master Calc'!F14)","v":3000},{"$f":"IF('GP Master Calc'!G14=\"\",\"\",'GP Master Calc'!G14)","v":""},null,{"$f":"'GP Master Calc'!J14","v":"Included"}]
[6,{"$f":"IF('GP Master Calc'!B15=\"\",\"\",'GP Master Calc'!B15)","v":"Limited User CAL (Concurrent User)"},{"$f":"IF('GP Master Calc'!C17=\"\",\"\",'GP Master Calc'!C17)","v":""},{"$f":"IF('GP Master Calc'!D15=\"\",\"\",'GP Master Calc'!D15)","v":109098616},{"$f":"IF('GP Master Calc'!E15=\"\",\"\",'GP Master Calc'!E15)","v":600},{"$f":"IF('GP Master Calc'!F15=\"\",\"\",'GP Master Calc'!F15)","v":3600},{"$f":"IF('GP Master Calc'!G15=\"\",\"\",'GP Master Calc'!G15)","v":""},null,{"$f":"'GP Master Calc'!J15","v":"Included"}]
[null,{"$f":"IF('GP Master Calc'!D16=\"\",\"\",'GP Master Calc'!D16)","v":"Sub Total of ERP Solution Suite & Users"},null,null,null,{"$f":"IF('GP Master Calc'!F16=\"\",\"\",'GP Master Calc'!F16)","v":11600},{"$f":"IF('GP Master Calc'!G16=\"\",\"\",'GP Master Calc'!G16)","v":""}]
[null,{"$f":"IF('GP Master Calc'!B17=\"\",\"\",'GP Master Calc'!B17)","v":"Configuration and Development"},{"$f":"IF('GP Master Calc'!C17=\"\",\"\",'GP Master Calc'!C17)","v":""},{"$f":"IF('GP Master Calc'!D17=\"\",\"\",'GP Master Calc'!D17)","v":""},{"$f":"IF('GP Master Calc'!E17=\"\",\"\",'GP Master Calc'!E17)","v":""},{"$f":"IF('GP Master Calc'!F17=\"\",\"\",'GP Master Calc'!F17)","v":""},{"$f":"IF('GP Master Calc'!G17=\"\",\"\",'GP Master Calc'!G17)","v":""},null,{"$f":"'GP Master Calc'!J17","v":"Included"}]
[0,{"$f":"IF('GP Master Calc'!B18=\"\",\"\",'GP Master Calc'!B18)","v":"Customization Pack"},{"$f":"IF('GP Master Calc'!C18=\"\",\"\",'GP Master Calc'!C18)","v":""},{"$f":"IF('GP Master Calc'!D18=\"\",\"\",'GP Master Calc'!D18)","v":109099124},{"$f":"IF('GP Master Calc'!E18=\"\",\"\",'GP Master Calc'!E18)","v":6000},{"$f":"IF('GP Master Calc'!F18=\"\",\"\",'GP Master Calc'!F18)","v":0},{"$f":"IF('GP Master Calc'!G18=\"\",\"\",'GP Master Calc'!G18)","v":""},null,{"$f":"'GP Master Calc'!J18","v":"Included"}]
[null,{"$f":"IF('GP Master Calc'!B19=\"\",\"\",'GP Master Calc'!B19)","v":"Business Intelligence and Reporting"},{"$f":"IF('GP Master Calc'!C19=\"\",\"\",'GP Master Calc'!C19)","v":""},{"$f":"IF('GP Master Calc'!D19=\"\",\"\",'GP Master Calc'!D19)","v":""},{"$f":"IF('GP Master Calc'!E19=\"\",\"\",'GP Master Calc'!E19)","v":""},{"$f":"IF('GP Master Calc'!F19=\"\",\"\",'GP Master Calc'!F19)","v":""},{"$f":"IF('GP Master Calc'!G19=\"\",\"\",'GP Master Calc'!G19)","v":""},null,{"$f":"'GP Master Calc'!J19","v":"Included"}]
[0,{"$f":"IF('GP Master Calc'!B20=\"\",\"\",'GP Master Calc'!B20)","v":"SmartList Builder Pack"},null,{"$f":"IF('GP Master Calc'!D20=\"\",\"\",'GP Master Calc'!D20)","v":109100028},{"$f":"IF('GP Master Calc'!E20=\"\",\"\",'GP Master Calc'!E20)","v":2000},{"$f":"IF('GP Master Calc'!F20=\"\",\"\",'GP Master Calc'!F20)","v":0},{"$f":"IF('GP Master Calc'!G20=\"\",\"\",'GP Master Calc'!G20)","v":""},null,{"$f":"'GP Master Calc'!J20","v":"Included"}]
[null,{"$f":"IF('GP Master Calc'!B21=\"\",\"\",'GP Master Calc'!B21)","v":"Human Resource Management"},null,{"$f":"IF('GP Master Calc'!D21=\"\",\"\",'GP Master Calc'!D21)","v":""},{"$f":"IF('GP Master Calc'!E21=\"\",\"\",'GP Master Calc'!E21)","v":""},{"$f":"IF('GP Master Calc'!F21=\"\",\"\",'GP Master Calc'!F21)","v":""},null,null,{"$f":"'GP Master Calc'!J21","v":"Included"}]
[0,{"$f":"IF('GP Master Calc'!B22=\"\",\"\",'GP Master Calc'!B22)","v":"Extended Human Resources and Payroll "},{"$f":"IF('GP Master Calc'!C22=\"\",\"\",'GP Master Calc'!C22)","v":""},{"$f":"IF('GP Master Calc'!D22=\"\",\"\",'GP Master Calc'!D22)","v":109100029},{"$f":"IF('GP Master Calc'!E22=\"\",\"\",'GP Master Calc'!E22)","v":7000},{"$f":"IF('GP Master Calc'!F22=\"\",\"\",'GP Master Calc'!F22)","v":0},{"$f":"IF('GP Master Calc'!G22=\"\",\"\",'GP Master Calc'!G22)","v":""},null,{"$f":"'GP Master Calc'!J22","v":"Included"}]
[null,{"$f":"IF('GP Master Calc'!B23=\"\",\"\",'GP Master Calc'!B23)","v":"Financial Management"},{"$f":"IF('GP Master Calc'!C23=\"\",\"\",'GP Master Calc'!C23)","v":""},{"$f":"IF('GP Master Calc'!D23=\"\",\"\",'GP Master Calc'!D23)","v":""},{"$f":"IF('GP Master Calc'!E23=\"\",\"\",'GP Master Calc'!E23)","v":""},{"$f":"IF('GP Master Calc'!F23=\"\",\"\",'GP Master Calc'!F23)","v":""},null,null,{"$f":"'GP Master Calc'!J23","v":"Included"}]
[0,{"$f":"IF('GP Master Calc'!B24=\"\",\"\",'GP Master Calc'!B24)","v":"Collections Management"},{"$f":"IF('GP Master Calc'!C24=\"\",\"\",'GP Master Calc'!C24)","v":""},{"$f":"IF('GP Master Calc'!D24=\"\",\"\",'GP Master Calc'!D24)","v":109100859},{"$f":"IF('GP Master Calc'!E24=\"\",\"\",'GP Master Calc'!E24)","v":3500},{"$f":"IF('GP Master Calc'!F24=\"\",\"\",'GP Master Calc'!F24)","v":0},{"$f":"IF('GP Master Calc'!G24=\"\",\"\",'GP Master Calc'!G24)","v":""},null,{"$f":"'GP Master Calc'!J24","v":"Included"}]
[null,{"$f":"IF('GP Master Calc'!B25=\"\",\"\",'GP Master Calc'!B25)","v":""},{"$f":"IF('GP Master Calc'!C25=\"\",\"\",'GP Master Calc'!C25)","v":""},{"$f":"IF('GP Master Calc'!D25=\"\",\"\",'GP Master Calc'!D25)","v":"Sub Total of A La Carte"},null,{"$f":"IF('GP Master Calc'!F25=\"\",\"\",'GP Master Calc'!F25)","v":0},{"$f":"IF('GP Master Calc'!G25=\"\",\"\",'GP Master Calc'!G25)","v":""},null,{"$f":"'GP Master Calc'!J25","v":"Included"}]
[null,{"$f":"IF('GP Master Calc'!B26=\"\",\"\",'GP Master Calc'!B26)","v":"Database"},{"$f":"IF('GP Master Calc'!C26=\"\",\"\",'GP Master Calc'!C26)","v":""},{"$f":"IF('GP Master Calc'!D26=\"\",\"\",'GP Master Calc'!D26)","v":"See Note"},{"$f":"IF('GP Master Calc'!E26=\"\",\"\",'GP Master Calc'!E26)","v":""},{"$f":"IF('GP Master Calc'!F26=\"\",\"\",'GP Master Calc'!F26)","v":""},null,null,{"$f":"'GP Master Calc'!J26","v":"Included"}]
[0,{"$f":"IF('GP Master Calc'!B27=\"\",\"\",'GP Master Calc'!B27)","v":"Microsoft® SQL Server® 2008 R2  Standard Edition Runtime Server License  (English)"},{"$f":"IF('GP Master Calc'!C27=\"\",\"\",'GP Master Calc'!C27)","v":""},{"$f":"IF('GP Master Calc'!D27=\"\",\"\",'GP Master Calc'!D27)","v":109100716},{"$f":"IF('GP Master Calc'!E27=\"\",\"\",'GP Master Calc'!E27)","v":6},{"$f":"IF('GP Master Calc'!F27=\"\",\"\",'GP Master Calc'!F27)","v":0},{"$f":"IF('GP Master Calc'!G27=\"\",\"\",'GP Master Calc'!G27)","v":""},null,{"$f":"'GP Master Calc'!J27","v":"Included"}]
[0,{"$f":"IF('GP Master Calc'!B28=\"\",\"\",'GP Master Calc'!B28)","v":"Microsoft® SQL Server® 2008 R2  Standard Edition Runtime CAL (English)"},{"$f":"IF('GP Master Calc'!C28=\"\",\"\",'GP Master Calc'!C28)","v":""},{"$f":"IF('GP Master Calc'!D28=\"\",\"\",'GP Master Calc'!D28)","v":109100717},{"$f":"IF('GP Master Calc'!E28=\"\",\"\",'GP Master Calc'!E28)","v":110},{"$f":"IF('GP Master Calc'!F28=\"\",\"\",'GP Master Calc'!F28)","v":0},{"$f":"IF('GP Master Calc'!G28=\"\",\"\",'GP Master Calc'!G28)","v":"Microsoft® SQL Server® 2008 R2  Standard Edition Runtime Server License - See note C24"},null,{"$f":"'GP Master Calc'!J28","v":"Included"}]
[0,{"$f":"IF('GP Master Calc'!B29=\"\",\"\",'GP Master Calc'!B29)","v":"Microsoft® SQL Server® 2008 R2  Enterprise Edition Runtime Server License (English)"},{"$f":"IF('GP Master Calc'!C29=\"\",\"\",'GP Master Calc'!C29)","v":""},{"$f":"IF('GP Master Calc'!D29=\"\",\"\",'GP Master Calc'!D29)","v":109100703},{"$f":"IF('GP Master Calc'!E29=\"\",\"\",'GP Master Calc'!E29)","v":51},{"$f":"IF('GP Master Calc'!F29=\"\",\"\",'GP Master Calc'!F29)","v":0},{"$f":"IF('GP Master Calc'!G29=\"\",\"\",'GP Master Calc'!G29)","v":""},null,{"$f":"'GP Master Calc'!J29","v":"Included"}]
[0,{"$f":"IF('GP Master Calc'!B30=\"\",\"\",'GP Master Calc'!B30)","v":"Microsoft® SQL Server® 2008 R2  Enterprise Edition Runtime CAL  (English)"},{"$f":"IF('GP Master Calc'!C30=\"\",\"\",'GP Master Calc'!C30)","v":""},{"$f":"IF('GP Master Calc'!D30=\"\",\"\",'GP Master Calc'!D30)","v":109100709},{"$f":"IF('GP Master Calc'!E30=\"\",\"\",'GP Master Calc'!E30)","v":200},{"$f":"IF('GP Master Calc'!F30=\"\",\"\",'GP Master Calc'!F30)","v":0},{"$f":"IF('GP Master Calc'!G30=\"\",\"\",'GP Master Calc'!G30)","v":"Microsoft® SQL Server® 2008 R2  Enterprise Edition Runtime Server License - See note C24"},null,{"$f":"'GP Master Calc'!J30","v":"Included"}]
[null,{"$f":"IF('GP Master Calc'!B31=\"\",\"\",'GP Master Calc'!B31)","v":""},{"$f":"IF('GP Master Calc'!C31=\"\",\"\",'GP Master Calc'!C31)","v":""},{"$f":"IF('GP Master Calc'!D31=\"\",\"\",'GP Master Calc'!D31)","v":"Sub Total of Database"},null,{"$f":"IF('GP Master Calc'!F31=\"\",\"\",'GP Master Calc'!F31)","v":0},null,null,{"$f":"'GP Master Calc'!J31","v":"Included"}]
[null,{"$f":"IF('GP Master Calc'!B32=\"\",\"\",'GP Master Calc'!B32)","v":"Service Plans"},{"$f":"IF('GP Master Calc'!C32=\"\",\"\",'GP Master Calc'!C32)","v":""},{"$f":"IF('GP Master Calc'!D32=\"\",\"\",'GP Master Calc'!D32)","v":""},{"$f":"IF('GP Master Calc'!E32=\"\",\"\",'GP Master Calc'!E32)","v":""},{"$f":"IF('GP Master Calc'!F32=\"\",\"\",'GP Master Calc'!F32)","v":""},null,null,{"$f":"'GP Master Calc'!J32","v":"Included"}]
[0,{"$f":"IF('GP Master Calc'!B33=\"\",\"\",'GP Master Calc'!B33)","v":"Enhancement Plan"},{"$f":"IF('GP Master Calc'!C33=\"\",\"\",'GP Master Calc'!C33)","v":""},{"$f":"IF('GP Master Calc'!D33=\"\",\"\",'GP Master Calc'!D33)","v":""},{"$f":"IF('GP Master Calc'!E33=\"\",\"\",'GP Master Calc'!E33)","v":""},{"$f":"IF('GP Master Calc'!F33=\"\",\"\",'GP Master Calc'!F33)","v":0},null,null,{"$f":"'GP Master Calc'!J33","v":"Not Included"}]
[1,{"$f":"IF('GP Master Calc'!B34=\"\",\"\",'GP Master Calc'!B34)","v":"Three Year Business Ready Enhancement Plan"},{"$f":"IF('GP Master Calc'!C34=\"\",\"\",'GP Master Calc'!C34)","v":""},{"$f":"IF('GP Master Calc'!D34=\"\",\"\",'GP Master Calc'!D34)","v":""},{"$f":"IF('GP Master Calc'!E34=\"\",\"\",'GP Master Calc'!E34)","v":0.16},{"$f":"IF('GP Master Calc'!F34=\"\",\"\",'GP Master Calc'!F34)","v":1856},null,null,{"$f":"'GP Master Calc'!J34","v":"Included"}]
[0,{"$f":"IF('GP Master Calc'!B35=\"\",\"\",'GP Master Calc'!B35)","v":"Business Ready Enhancement Plus Plan (LATAM)"},{"$f":"IF('GP Master Calc'!C35=\"\",\"\",'GP Master Calc'!C35)","v":""},{"$f":"IF('GP Master Calc'!D35=\"\",\"\",'GP Master Calc'!D35)","v":""},{"$f":"IF('GP Master Calc'!E35=\"\",\"\",'GP Master Calc'!E35)","v":""},{"$f":"IF('GP Master Calc'!F35=\"\",\"\",'GP Master Calc'!F35)","v":0},null,null,{"$f":"'GP Master Calc'!J35","v":"Not Included"}]
[0,{"$f":"IF('GP Master Calc'!B36=\"\",\"\",'GP Master Calc'!B36)","v":"Business Ready Advantage Plan"},{"$f":"IF('GP Master Calc'!C36=\"\",\"\",'GP Master Calc'!C36)","v":""},{"$f":"IF('GP Master Calc'!D36=\"\",\"\",'GP Master Calc'!D36)","v":""},{"$f":"IF('GP Master Calc'!E36=\"\",\"\",'GP Master Calc'!E36)","v":0.18},{"$f":"IF('GP Master Calc'!F36=\"\",\"\",'GP Master Calc'!F36)","v":0},null,null,{"$f":"'GP Master Calc'!J36","v":"Included"}]
[0,{"$f":"IF('GP Master Calc'!B37=\"\",\"\",'GP Master Calc'!B37)","v":"Three Year Business Ready Advantage Plan"},{"$f":"IF('GP Master Calc'!C37=\"\",\"\",'GP Master Calc'!C37)","v":""},{"$f":"IF('GP Master Calc'!D37=\"\",\"\",'GP Master Calc'!D37)","v":""},{"$f":"IF('GP Master Calc'!E37=\"\",\"\",'GP Master Calc'!E37)","v":0.18},{"$f":"IF('GP Master Calc'!F37=\"\",\"\",'GP Master Calc'!F37)","v":0},null,null,{"$f":"'GP Master Calc'!J37","v":"Included"}]
[0,{"$f":"IF('GP Master Calc'!B38=\"\",\"\",'GP Master Calc'!B38)","v":"Business Ready Advantage Plus Plan"},{"$f":"IF('GP Master Calc'!C38=\"\",\"\",'GP Master Calc'!C38)","v":""},{"$f":"IF('GP Master Calc'!D38=\"\",\"\",'GP Master Calc'!D38)","v":""},{"$f":"IF('GP Master Calc'!E38=\"\",\"\",'GP Master Calc'!E38)","v":0.25},{"$f":"IF('GP Master Calc'!F38=\"\",\"\",'GP Master Calc'!F38)","v":0},null,null,{"$f":"'GP Master Calc'!J38","v":"Included"}]
[null,{"$f":"IF('GP Master Calc'!B39=\"\",\"\",'GP Master Calc'!B39)","v":"Total Enchancement"},null,null,null,{"$f":"IF('GP Master Calc'!F39=\"\",\"\",'GP Master Calc'!F39)","v":1856},null,null,{"$f":"'GP Master Calc'!J39","v":"Included"}]
[null,{"$f":"IF('GP Master Calc'!B40=\"\",\"\",'GP Master Calc'!B40)","v":""},{"$f":"IF('GP Master Calc'!C40=\"\",\"\",'GP Master Calc'!C40)","v":""},{"$f":"IF('GP Master Calc'!D40=\"\",\"\",'GP Master Calc'!D40)","v":""},{"$f":"IF('GP Master Calc'!E40=\"\",\"\",'GP Master Calc'!E40)","v":""},{"$f":"IF('GP Master Calc'!F40=\"\",\"\",'GP Master Calc'!F40)","v":""},null,null,{"$f":"'GP Master Calc'!J40","v":"Included"}]
[null,{"$f":"IF('GP Master Calc'!B41=\"\",\"\",'GP Master Calc'!B41)","v":"Total Solution Cost"},null,null,null,{"$f":"IF('GP Master Calc'!F41=\"\",\"\",'GP Master Calc'!F41)","v":13456},null,null,{"$f":"'GP Master Calc'!J41","v":"Included"}]
[null,null,null,null,null,null,null,null,{"$f":"'GP Master Calc'!J42","v":"Included"}]
[null,{"$f":"IF('GP Master Calc'!B43=\"\",\"\",'GP Master Calc'!B43)","v":"This document is intended for general information purposes only, and we have taken due care in its preparation. All embedded functionality used to facilitate price calculations is provided AS IS. Any risk arising from the use of the information shall rest with the recipient and nothing herein shall be construed as constituting any kind of warranty or representation, express, implied or statutory.  Users are responsible for information that is input using the pricing calculator embedded in the offline pricelist.  Under certain circumstances the figures resulting from the applied pricing calculations embedded in the price list, which are shown for your convenience in this pricelist, may differ from those reflected in the Order Summary Page in Order Central. In these scenarios, the figures shown in the Order Summary Page will control."},null,null,null,null,null,null,{"$f":"'GP Master Calc'!J43","v":"Included"}]
[null,{"$f":"IF('GP Master Calc'!B44=\"\",\"\",'GP Master Calc'!B44)","v":"European Union/European Free Trade Association policy: Upward price adjustments due to currency alignment are not subject to the standard 90-day Solution Provider Agreement notification policy.  Notice of currency alignment changes will be published at least 30 days in advance of the effective date.  The Euro price list is the official price list for all reference purposes for customers located in the European Union/European Free Trade Association.  Microsoft’s European Operating Centre (EOC) supports five additional currencies for pricing purposes:  British Pound, Danish Krone, Norwegian Krone, Swedish Krona, and Swiss Franc.  Price lists reflected in these local currencies are listed for your convenience only."},null,null,null,null,null,null,{"$f":"'GP Master Calc'!J44","v":"Not Included"}]
[null,null,null,null,null,null,null,null,{"$f":"'GP Master Calc'!J45","v":0}]

{"sheet":"Localization Disclaimer","index":4,"n_rows":5,"n_cols":2,"rows_kept":5,"cut":false,"hidden":false,"merged":[]}
["Localization Disclaimer"]
[]
["Microsoft Confidential","           BACK to Dynamics GP Price List"]
["Please note the disclaimer to the right as applied to the following countries:\n\nAustralia, Argentina, Canada, Chile, Colombia, United Kingdom, United States","Microsoft Dynamics GP 2013 includes features and functionality designed to address certain tax, financial or accounting laws and/or regulations, and commercial requirements, for this geographic region.  Laws and regulations vary by region and this software does not address all laws, regulations or commercial requirements in this region.  Click www.microsoft.com/en-us/dynamics/erp-buy-gp-software.aspx for a list of geographic regions and languages that Microsoft makes generally available for Microsoft Dynamics GP 2013.\n\nMicrosoft understands there may be circumstances where a customer desires to use certain modules or functionality that was localized and/or translated for Microsoft Dynamics GP 2013 in a particular region and use it outside of the geographic region for which it was created.  Localizations and/or translations for Microsoft Dynamics GP 2013 are provided only for the geographic region for which they were created.  Since laws and regulations vary by region, differences in laws or regulations may affect use of the desired functionality in regions for which it was not created.  Microsoft does not make any representation, guarantee, warranty (express, implied or otherwise) or assurance about the performance or suitability of any localized and/or translated version of Microsoft Dynamics GP 2013 (including any online services available through this software) that is used outside of the territory for which it was created and where Microsoft makes such software or services generally commercially available.  Consult your tax professional for the geographic region where you intend to use this software to determine if the functionality is appropriate for use in that region.\n\nPartners who desire to perform localizations and/or translations of Microsoft Dynamics GP 2013 must have a current and valid Master Partner Localization and Translation License Agreement (MPLLA).  For more information about the MPLLA and the Microsoft Dynamics Partner Localization and Translation Licensing Program, see https://mbs.microsoft.com/partnersource/partneressentials/pllp or contact your Partner Account Manager."]
["For all countries not listed above, please note the disclaimer to the right.","While Microsoft Dynamics GP 2013 is available in this region, it has not been localized and/or translated by Microsoft to meet any of the tax, financial or accounting laws and/or regulations for this geographic region.  Laws and regulations vary by region.  Consult your tax professional for the geographic region where you intend to use this software to determine if the functionality is appropriate for use in that region.\n\nPartners who desire to perform localizations and/or translations of Microsoft Dynamics GP 2013 must have a current and valid Master Partner Localization and Translation License Agreement (MPLLA) before orders for licenses will be processed.  For more information about the MPLLA and the Microsoft Dynamics Partner Localization and Translation Licensing Program, see https://mbs.microsoft.com/partnersource/partneressentials/pllp or contact your Partner Account Manager.\n"]

{"sheet":"Dynamics CRM","index":5,"n_rows":86,"n_cols":19,"rows_kept":86,"cut":false,"hidden":false,"merged":[[72,0,72,4],[74,0,74,4],[70,1,70,4]]}
["Microsoft Dynamics® CRM 2011 Price List"]
[]
[null,"Customer Location:"]
[null,null,null,null,{"$f":"'CRM Master Calc'!F4","v":"Price List – Effective April, 2013"}]
[null,null,null,null,"Microsoft Confidential"]
[null,null,null,null,null,null,null,null,null,null,null,null,null,null,null,null,null,null," "]
[{"$f":"IF('CRM Master Calc'!A7=\"\",\"\",'CRM Master Calc'!A7)","v":"Qty"},{"$f":"IF('CRM Master Calc'!B7=\"\",\"\",'CRM Master Calc'!B7)","v":"SKU"},{"$f":"IF('CRM Master Calc'!C7=\"\",\"\",'CRM Master Calc'!C7)","v":"Item"},{"$f":"IF('CRM Master Calc'!D7=\"\",\"\",'CRM Master Calc'!D7)","v":"USD"},{"$f":"IF('CRM Master Calc'!E7=\"\",\"\",'CRM Master Calc'!E7)","v":"Total"},null,"Status"]
[1,{"$f":"IF('CRM Master Calc'!B8=\"\",\"\",'CRM Master Calc'!B8)","v":109057076},{"$f":"IF('CRM Master Calc'!C8=\"\",\"\",'CRM Master Calc'!C8)","v":"Microsoft Dynamics CRM 2011 Server    "},{"$f":"IF('CRM Master Calc'!D8=\"\",\"\",'CRM Master Calc'!D8)","v":4999},{"$f":"IF('CRM Master Calc'!E8=\"\",\"\",'CRM Master Calc'!E8)","v":4999},null,{"$f":"'CRM Master Calc'!G8","v":"Included"}]
[5,{"$f":"IF('CRM Master Calc'!B9=\"\",\"\",'CRM Master Calc'!B9)","v":109056979},{"$f":"IF('CRM Master Calc'!C9=\"\",\"\",'CRM Master Calc'!C9)","v":"Microsoft Dynamics CRM 2011 User CAL (Named User)"},{"$f":"IF('CRM Master Calc'!D9=\"\",\"\",'CRM Master Calc'!D9)","v":999},{"$f":"IF('CRM Master Calc'!E9=\"\",\"\",'CRM Master Calc'!E9)","v":4995},null,{"$f":"'CRM Master Calc'!G9","v":"Included"}]
[0,{"$f":"IF('CRM Master Calc'!B10=\"\",\"\",'CRM Master Calc'!B10)","v":109056946},{"$f":"IF('CRM Master Calc'!C10=\"\",\"\",'CRM Master Calc'!C10)","v":"Microsoft Dynamics CRM 2011 Device CAL (Device)"},{"$f":"IF('CRM Master Calc'!D10=\"\",\"\",'CRM Master Calc'!D10)","v":999},{"$f":"IF('CRM Master Calc'!E10=\"\",\"\",'CRM Master Calc'!E10)","v":0},null,{"$f":"'CRM Master Calc'!G10","v":"Included"}]
[0,{"$f":"IF('CRM Master Calc'!B11=\"\",\"\",'CRM Master Calc'!B11)","v":109056958},{"$f":"IF('CRM Master Calc'!C11=\"\",\"\",'CRM Master Calc'!C11)","v":"Microsoft Dynamics CRM 2011 Full Use Additive User CAL (Named User)     "},{"$f":"IF('CRM Master Calc'!D11=\"\",\"\",'CRM Master Calc'!D11)","v":700},{"$f":"IF('CRM Master Calc'!E11=\"\",\"\",'CRM Master Calc'!E11)","v":0},null,{"$f":"'CRM Master Calc'!G11","v":"Included"}]
[0,{"$f":"IF('CRM Master Calc'!B12=\"\",\"\",'CRM Master Calc'!B12)","v":109056954},{"$f":"IF('CRM Master Calc'!C12=\"\",\"\",'CRM Master Calc'!C12)","v":"Microsoft Dynamics CRM 2011 Full Use Additive Device CAL     "},{"$f":"IF('CRM Master Calc'!D12=\"\",\"\",'CRM Master Calc'!D12)","v":700},{"$f":"IF('CRM Master Calc'!E12=\"\",\"\",'CRM Master Calc'!E12)","v":0},null,{"$f":"'CRM Master Calc'!G12","v":"Included"}]
[0,{"$f":"IF('CRM Master Calc'!B13=\"\",\"\",'CRM Master Calc'!B13)","v":109056970},{"$f":"IF('CRM Master Calc'!C13=\"\",\"\",'CRM Master Calc'!C13)","v":"Microsoft Dynamics CRM 2011 Limited User CAL (Named User)              "},{"$f":"IF('CRM Master Calc'!D13=\"\",\"\",'CRM Master Calc'!D13)","v":299},{"$f":"IF('CRM Master Calc'!E13=\"\",\"\",'CRM Master Calc'!E13)","v":0},null,{"$f":"'CRM Master Calc'!G13","v":"Included"}]
[0,{"$f":"IF('CRM Master Calc'!B14=\"\",\"\",'CRM Master Calc'!B14)","v":109056967},{"$f":"IF('CRM Master Calc'!C14=\"\",\"\",'CRM Master Calc'!C14)","v":"Microsoft Dynamics CRM 2011 Limited Device CAL"},{"$f":"IF('CRM Master Calc'!D14=\"\",\"\",'CRM Master Calc'!D14)","v":299},{"$f":"IF('CRM Master Calc'!E14=\"\",\"\",'CRM Master Calc'!E14)","v":0},null,{"$f":"'CRM Master Calc'!G14","v":"Included"}]
[0,{"$f":"IF('CRM Master Calc'!B15=\"\",\"\",'CRM Master Calc'!B15)","v":109057081},{"$f":"IF('CRM Master Calc'!C15=\"\",\"\",'CRM Master Calc'!C15)","v":"Microsoft Dynamics CRM 2011 Limited Use Additive User CAL"},{"$f":"IF('CRM Master Calc'!D15=\"\",\"\",'CRM Master Calc'!D15)","v":200},{"$f":"IF('CRM Master Calc'!E15=\"\",\"\",'CRM Master Calc'!E15)","v":0},null,{"$f":"'CRM Master Calc'!G15","v":"Included"}]
[0,{"$f":"IF('CRM Master Calc'!B16=\"\",\"\",'CRM Master Calc'!B16)","v":109057082},{"$f":"IF('CRM Master Calc'!C16=\"\",\"\",'CRM Master Calc'!C16)","v":"Microsoft Dynamics CRM 2011 Limited Use Additive Device CAL"},{"$f":"IF('CRM Master Calc'!D16=\"\",\"\",'CRM Master Calc'!D16)","v":200},{"$f":"IF('CRM Master Calc'!E16=\"\",\"\",'CRM Master Calc'!E16)","v":0},null,{"$f":"'CRM Master Calc'!G16","v":"Included"}]
[0,{"$f":"IF('CRM Master Calc'!B17=\"\",\"\",'CRM Master Calc'!B17)","v":109057079},{"$f":"IF('CRM Master Calc'!C17=\"\",\"\",'CRM Master Calc'!C17)","v":"Microsoft Dynamics CRM 2011 Employee Self Service User CAL"},{"$f":"IF('CRM Master Calc'!D17=\"\",\"\",'CRM Master Calc'!D17)","v":99},{"$f":"IF('CRM Master Calc'!E17=\"\",\"\",'CRM Master Calc'!E17)","v":0},null,{"$f":"'CRM Master Calc'!G17","v":"Included"}]
[0,{"$f":"IF('CRM Master Calc'!B18=\"\",\"\",'CRM Master Calc'!B18)","v":109057074},{"$f":"IF('CRM Master Calc'!C18=\"\",\"\",'CRM Master Calc'!C18)","v":"Microsoft Dynamics CRM 2011 Employee Self Service Device CAL"},{"$f":"IF('CRM Master Calc'!D18=\"\",\"\",'CRM Master Calc'!D18)","v":99},{"$f":"IF('CRM Master Calc'!E18=\"\",\"\",'CRM Master Calc'!E18)","v":0},null,{"$f":"'CRM Master Calc'!G18","v":"Included"}]
[0,{"$f":"IF('CRM Master Calc'!B19=\"\",\"\",'CRM Master Calc'!B19)","v":109056950},{"$f":"IF('CRM Master Calc'!C19=\"\",\"\",'CRM Master Calc'!C19)","v":"Microsoft Dynamics CRM 2011 External Connector "},{"$f":"IF('CRM Master Calc'!D19=\"\",\"\",'CRM Master Calc'!D19)","v":4999},{"$f":"IF('CRM Master Calc'!E19=\"\",\"\",'CRM Master Calc'!E19)","v":0},null,{"$f":"'CRM Master Calc'!G19","v":"Included"}]
[null,{"$f":"IF('CRM Master Calc'!B20=\"\",\"\",'CRM Master Calc'!B20)","v":""},{"$f":"IF('CRM Master Calc'!C20=\"\",\"\",'CRM Master Calc'!C20)","v":""},{"$f":"IF('CRM Master Calc'!D20=\"\",\"\",'CRM Master Calc'!D20)","v":""},{"$f":"IF('CRM Master Calc'!E20=\"\",\"\",'CRM Master Calc'!E20)","v":""},null,{"$f":"'CRM Master Calc'!G20","v":"Included"}]
[0,{"$f":"IF('CRM Master Calc'!B21=\"\",\"\",'CRM Master Calc'!B21)","v":109056938},{"$f":"IF('CRM Master Calc'!C21=\"\",\"\",'CRM Master Calc'!C21)","v":"Language: Arabic"},{"$f":"IF('CRM Master Calc'!D21=\"\",\"\",'CRM Master Calc'!D21)","v":0},{"$f":"IF('CRM Master Calc'!E21=\"\",\"\",'CRM Master Calc'!E21)","v":0},null,{"$f":"'CRM Master Calc'!G21","v":"Included"}]
[0,{"$f":"IF('CRM Master Calc'!B22=\"\",\"\",'CRM Master Calc'!B22)","v":109057049},{"$f":"IF('CRM Master Calc'!C22=\"\",\"\",'CRM Master Calc'!C22)","v":"Language: Portuguese (Brazil)"},{"$f":"IF('CRM Master Calc'!D22=\"\",\"\",'CRM Master Calc'!D22)","v":0},{"$f":"IF('CRM Master Calc'!E22=\"\",\"\",'CRM Master Calc'!E22)","v":0},null,{"$f":"'CRM Master Calc'!G22","v":"Included"}]
[0,{"$f":"IF('CRM Master Calc'!B23=\"\",\"\",'CRM Master Calc'!B23)","v":109056982},{"$f":"IF('CRM Master Calc'!C23=\"\",\"\",'CRM Master Calc'!C23)","v":"Language: Chinese Simplified"},{"$f":"IF('CRM Master Calc'!D23=\"\",\"\",'CRM Master Calc'!D23)","v":0},{"$f":"IF('CRM Master Calc'!E23=\"\",\"\",'CRM Master Calc'!E23)","v":0},null,{"$f":"'CRM Master Calc'!G23","v":"Included"}]
[0,{"$f":"IF('CRM Master Calc'!B24=\"\",\"\",'CRM Master Calc'!B24)","v":109056984},{"$f":"IF('CRM Master Calc'!C24=\"\",\"\",'CRM Master Calc'!C24)","v":"Language: Chinese Traditional"},{"$f":"IF('CRM Master Calc'!D24=\"\",\"\",'CRM Master Calc'!D24)","v":0},{"$f":"IF('CRM Master Calc'!E24=\"\",\"\",'CRM Master Calc'!E24)","v":0},null,{"$f":"'CRM Master Calc'!G24","v":"Included"}]
[0,{"$f":"IF('CRM Master Calc'!B25=\"\",\"\",'CRM Master Calc'!B25)","v":109056983},{"$f":"IF('CRM Master Calc'!C25=\"\",\"\",'CRM Master Calc'!C25)","v":"Language: Chinese (Hong Kong SAR)"},{"$f":"IF('CRM Master Calc'!D25=\"\",\"\",'CRM Master Calc'!D25)","v":0},{"$f":"IF('CRM Master Calc'!E25=\"\",\"\",'CRM Master Calc'!E25)","v":0},null,{"$f":"'CRM Master Calc'!G25","v":"Included"}]
[0,{"$f":"IF('CRM Master Calc'!B26=\"\",\"\",'CRM Master Calc'!B26)","v":109056985},{"$f":"IF('CRM Master Calc'!C26=\"\",\"\",'CRM Master Calc'!C26)","v":"Language: Czech"},{"$f":"IF('CRM Master Calc'!D26=\"\",\"\",'CRM Master Calc'!D26)","v":0},{"$f":"IF('CRM Master Calc'!E26=\"\",\"\",'CRM Master Calc'!E26)","v":0},null,{"$f":"'CRM Master Calc'!G26","v":"Included"}]
[0,{"$f":"IF('CRM Master Calc'!B27=\"\",\"\",'CRM Master Calc'!B27)","v":109056986},{"$f":"IF('CRM Master Calc'!C27=\"\",\"\",'CRM Master Calc'!C27)","v":"Language: Danish"},{"$f":"IF('CRM Master Calc'!D27=\"\",\"\",'CRM Master Calc'!D27)","v":0},{"$f":"IF('CRM Master Calc'!E27=\"\",\"\",'CRM Master Calc'!E27)","v":0},null,{"$f":"'CRM Master Calc'!G27","v":"Included"}]
[0,{"$f":"IF('CRM Master Calc'!B28=\"\",\"\",'CRM Master Calc'!B28)","v":109056948},{"$f":"IF('CRM Master Calc'!C28=\"\",\"\",'CRM Master Calc'!C28)","v":"Language: Dutch"},{"$f":"IF('CRM Master Calc'!D28=\"\",\"\",'CRM Master Calc'!D28)","v":0},{"$f":"IF('CRM Master Calc'!E28=\"\",\"\",'CRM Master Calc'!E28)","v":0},null,{"$f":"'CRM Master Calc'!G28","v":"Included"}]
[0,{"$f":"IF('CRM Master Calc'!B29=\"\",\"\",'CRM Master Calc'!B29)","v":109056949},{"$f":"IF('CRM Master Calc'!C29=\"\",\"\",'CRM Master Calc'!C29)","v":"Language: English"},{"$f":"IF('CRM Master Calc'!D29=\"\",\"\",'CRM Master Calc'!D29)","v":0},{"$f":"IF('CRM Master Calc'!E29=\"\",\"\",'CRM Master Calc'!E29)","v":0},null,{"$f":"'CRM Master Calc'!G29","v":"Included"}]
[0,{"$f":"IF('CRM Master Calc'!B30=\"\",\"\",'CRM Master Calc'!B30)","v":109056952},{"$f":"IF('CRM Master Calc'!C30=\"\",\"\",'CRM Master Calc'!C30)","v":"Language: Finnish"},{"$f":"IF('CRM Master Calc'!D30=\"\",\"\",'CRM Master Calc'!D30)","v":0},{"$f":"IF('CRM Master Calc'!E30=\"\",\"\",'CRM Master Calc'!E30)","v":0},null,{"$f":"'CRM Master Calc'!G30","v":"Included"}]
[0,{"$f":"IF('CRM Master Calc'!B31=\"\",\"\",'CRM Master Calc'!B31)","v":109056953},{"$f":"IF('CRM Master Calc'!C31=\"\",\"\",'CRM Master Calc'!C31)","v":"Language: French"},{"$f":"IF('CRM Master Calc'!D31=\"\",\"\",'CRM Master Calc'!D31)","v":0},{"$f":"IF('CRM Master Calc'!E31=\"\",\"\",'CRM Master Calc'!E31)","v":0},null,{"$f":"'CRM Master Calc'!G31","v":"Included"}]
[0,{"$f":"IF('CRM Master Calc'!B32=\"\",\"\",'CRM Master Calc'!B32)","v":109056960},{"$f":"IF('CRM Master Calc'!C32=\"\",\"\",'CRM Master Calc'!C32)","v":"Language: German"},{"$f":"IF('CRM Master Calc'!D32=\"\",\"\",'CRM Master Calc'!D32)","v":0},{"$f":"IF('CRM Master Calc'!E32=\"\",\"\",'CRM Master Calc'!E32)","v":0},null,{"$f":"'CRM Master Calc'!G32","v":"Included"}]
[0,{"$f":"IF('CRM Master Calc'!B33=\"\",\"\",'CRM Master Calc'!B33)","v":109056961},{"$f":"IF('CRM Master Calc'!C33=\"\",\"\",'CRM Master Calc'!C33)","v":"Language: Greek"},{"$f":"IF('CRM Master Calc'!D33=\"\",\"\",'CRM Master Calc'!D33)","v":0},{"$f":"IF('CRM Master Calc'!E33=\"\",\"\",'CRM Master Calc'!E33)","v":0},null,{"$f":"'CRM Master Calc'!G33","v":"Included"}]
[0,{"$f":"IF('CRM Master Calc'!B34=\"\",\"\",'CRM Master Calc'!B34)","v":109056962},{"$f":"IF('CRM Master Calc'!C34=\"\",\"\",'CRM Master Calc'!C34)","v":"Language: Hebrew"},{"$f":"IF('CRM Master Calc'!D34=\"\",\"\",'CRM Master Calc'!D34)","v":0},{"$f":"IF('CRM Master Calc'!E34=\"\",\"\",'CRM Master Calc'!E34)","v":0},null,{"$f":"'CRM Master Calc'!G34","v":"Included"}]
[0,{"$f":"IF('CRM Master Calc'!B35=\"\",\"\",'CRM Master Calc'!B35)","v":109056963},{"$f":"IF('CRM Master Calc'!C35=\"\",\"\",'CRM Master Calc'!C35)","v":"Language: Hungarian"},{"$f":"IF('CRM Master Calc'!D35=\"\",\"\",'CRM Master Calc'!D35)","v":0},{"$f":"IF('CRM Master Calc'!E35=\"\",\"\",'CRM Master Calc'!E35)","v":0},null,{"$f":"'CRM Master Calc'!G35","v":"Included"}]
[0,{"$f":"IF('CRM Master Calc'!B36=\"\",\"\",'CRM Master Calc'!B36)","v":109056964},{"$f":"IF('CRM Master Calc'!C36=\"\",\"\",'CRM Master Calc'!C36)","v":"Language: Italian"},{"$f":"IF('CRM Master Calc'!D36=\"\",\"\",'CRM Master Calc'!D36)","v":0},{"$f":"IF('CRM Master Calc'!E36=\"\",\"\",'CRM Master Calc'!E36)","v":0},null,{"$f":"'CRM Master Calc'!G36","v":"Included"}]
[0,{"$f":"IF('CRM Master Calc'!B37=\"\",\"\",'CRM Master Calc'!B37)","v":109056965},{"$f":"IF('CRM Master Calc'!C37=\"\",\"\",'CRM Master Calc'!C37)","v":"Language: Japanese"},{"$f":"IF('CRM Master Calc'!D37=\"\",\"\",'CRM Master Calc'!D37)","v":0},{"$f":"IF('CRM Master Calc'!E37=\"\",\"\",'CRM Master Calc'!E37)","v":0},null,{"$f":"'CRM Master Calc'!G37","v":"Included"}]
[0,{"$f":"IF('CRM Master Calc'!B38=\"\",\"\",'CRM Master Calc'!B38)","v":109056966},{"$f":"IF('CRM Master Calc'!C38=\"\",\"\",'CRM Master Calc'!C38)","v":"Language: Korean"},{"$f":"IF('CRM Master Calc'!D38=\"\",\"\",'CRM Master Calc'!D38)","v":0},{"$f":"IF('CRM Master Calc'!E38=\"\",\"\",'CRM Master Calc'!E38)","v":0},null,{"$f":"'CRM Master Calc'!G38","v":"Included"}]
[0,{"$f":"IF('CRM Master Calc'!B39=\"\",\"\",'CRM Master Calc'!B39)","v":109056972},{"$f":"IF('CRM Master Calc'!C39=\"\",\"\",'CRM Master Calc'!C39)","v":"Language: Norwegian (Bokmal)"},{"$f":"IF('CRM Master Calc'!D39=\"\",\"\",'CRM Master Calc'!D39)","v":0},{"$f":"IF('CRM Master Calc'!E39=\"\",\"\",'CRM Master Calc'!E39)","v":0},null,{"$f":"'CRM Master Calc'!G39","v":"Included"}]
[0,{"$f":"IF('CRM Master Calc'!B40=\"\",\"\",'CRM Master Calc'!B40)","v":109056973},{"$f":"IF('CRM Master Calc'!C40=\"\",\"\",'CRM Master Calc'!C40)","v":"Language: Polish"},{"$f":"IF('CRM Master Calc'!D40=\"\",\"\",'CRM Master Calc'!D40)","v":0},{"$f":"IF('CRM Master Calc'!E40=\"\",\"\",'CRM Master Calc'!E40)","v":0},null,{"$f":"'CRM Master Calc'!G40","v":"Included"}]
[0,{"$f":"IF('CRM Master Calc'!B41=\"\",\"\",'CRM Master Calc'!B41)","v":109056974},{"$f":"IF('CRM Master Calc'!C41=\"\",\"\",'CRM Master Calc'!C41)","v":"Language: Portuguese (Portugal)"},{"$f":"IF('CRM Master Calc'!D41=\"\",\"\",'CRM Master Calc'!D41)","v":0},{"$f":"IF('CRM Master Calc'!E41=\"\",\"\",'CRM Master Calc'!E41)","v":0},null,{"$f":"'CRM Master Calc'!G41","v":"Included"}]
[0,{"$f":"IF('CRM Master Calc'!B42=\"\",\"\",'CRM Master Calc'!B42)","v":109056975},{"$f":"IF('CRM Master Calc'!C42=\"\",\"\",'CRM Master Calc'!C42)","v":"Language: Russian"},{"$f":"IF('CRM Master Calc'!D42=\"\",\"\",'CRM Master Calc'!D42)","v":0},{"$f":"IF('CRM Master Calc'!E42=\"\",\"\",'CRM Master Calc'!E42)","v":0},null,{"$f":"'CRM Master Calc'!G42","v":"Included"}]
[0,{"$f":"IF('CRM Master Calc'!B43=\"\",\"\",'CRM Master Calc'!B43)","v":109056976},{"$f":"IF('CRM Master Calc'!C43=\"\",\"\",'CRM Master Calc'!C43)","v":"Language: Spanish"},{"$f":"IF('CRM Master Calc'!D43=\"\",\"\",'CRM Master Calc'!D43)","v":0},{"$f":"IF('CRM Master Calc'!E43=\"\",\"\",'CRM Master Calc'!E43)","v":0},null,{"$f":"'CRM Master Calc'!G43","v":"Included"}]
[0,{"$f":"IF('CRM Master Calc'!B44=\"\",\"\",'CRM Master Calc'!B44)","v":109056977},{"$f":"IF('CRM Master Calc'!C44=\"\",\"\",'CRM Master Calc'!C44)","v":"Language: Swedish"},{"$f":"IF('CRM Master Calc'!D44=\"\",\"\",'CRM Master Calc'!D44)","v":0},{"$f":"IF('CRM Master Calc'!E44=\"\",\"\",'CRM Master Calc'!E44)","v":0},null,{"$f":"'CRM Master Calc'!G44","v":"Included"}]
[0,{"$f":"IF('CRM Master Calc'!B45=\"\",\"\",'CRM Master Calc'!B45)","v":109056978},{"$f":"IF('CRM Master Calc'!C45=\"\",\"\",'CRM Master Calc'!C45)","v":"Language: Turkish"},{"$f":"IF('CRM Master Calc'!D45=\"\",\"\",'CRM Master Calc'!D45)","v":0},{"$f":"IF('CRM Master Calc'!E45=\"\",\"\",'CRM Master Calc'!E45)","v":0},null,{"$f":"'CRM Master Calc'!G45","v":"Included"}]
[{"$f":"IF('CRM Master Calc'!A46=\"\",\"\",'CRM Master Calc'!A46)","v":""},{"$f":"IF('CRM Master Calc'!B46=\"\",\"\",'CRM Master Calc'!B46)","v":""},{"$f":"IF('CRM Master Calc'!C46=\"\",\"\",'CRM Master Calc'!C46)","v":""},{"$f":"IF('CRM Master Calc'!D46=\"\",\"\",'CRM Master Calc'!D46)","v":""},{"$f":"IF('CRM Master Calc'!E46=\"\",\"\",'CRM Master Calc'!E46)","v":""},null,{"$f":"'CRM Master Calc'!G46","v":"Included"}]
[{"$f":"IF('CRM Master Calc'!A47=\"\",\"\",'CRM Master Calc'!A47)","v":""},{"$f":"IF('CRM Master Calc'!B47=\"\",\"\",'CRM Master Calc'!B47)","v":""},{"$f":"IF('CRM Master Calc'!C47=\"\",\"\",'CRM Master Calc'!C47)","v":""},{"$f":"IF('CRM Master Calc'!D47=\"\",\"\",'CRM Master Calc'!D47)","v":""},{"$f":"IF('CRM Master Calc'!E47=\"\",\"\",'CRM Master Calc'!E47)","v":""},null,{"$f":"'CRM Master Calc'!G47","v":"Included"}]
[{"$f":"IF('CRM Master Calc'!A48=\"\",\"\",'CRM Master Calc'!A48)","v":"CRM Software License Fee Sub-Total"},null,null,null,{"$f":"IF('CRM Master Calc'!E48=\"\",\"\",'CRM Master Calc'!E48)","v":9994},null,{"$f":"'CRM Master Calc'!G48","v":"Included"}]
[{"$f":"IF('CRM Master Calc'!A49=\"\",\"\",'CRM Master Calc'!A49)","v":""},{"$f":"IF('CRM Master Calc'!B49=\"\",\"\",'CRM Master Calc'!B49)","v":""},{"$f":"IF('CRM Master Calc'!C49=\"\",\"\",'CRM Master Calc'!C49)","v":""},{"$f":"IF('CRM Master Calc'!D49=\"\",\"\",'CRM Master Calc'!D49)","v":""},{"$f":"IF('CRM Master Calc'!E49=\"\",\"\",'CRM Master Calc'!E49)","v":""},null,{"$f":"'CRM Master Calc'!G49","v":"Included"}]
[{"$f":"IF('CRM Master Calc'!A50=\"\",\"\",'CRM Master Calc'!A50)","v":"Enhancement Plan (New customers must choose one of the following programs)"},null,null,null,{"$f":"IF('CRM Master Calc'!E50=\"\",\"\",'CRM Master Calc'!E50)","v":""},null,{"$f":"'CRM Master Calc'!G50","v":"Included"}]
[{"$f":"IF('CRM Master Calc'!A51=\"\",\"\",'CRM Master Calc'!A51)","v":"Select"},{"$f":"IF('CRM Master Calc'!B51=\"\",\"\",'CRM Master Calc'!B51)","v":""},{"$f":"IF('CRM Master Calc'!C51=\"\",\"\",'CRM Master Calc'!C51)","v":"Plan Name"},{"$f":"IF('CRM Master Calc'!D51=\"\",\"\",'CRM Master Calc'!D51)","v":"Rate"},{"$f":"IF('CRM Master Calc'!E51=\"\",\"\",'CRM Master Calc'!E51)","v":"Fee"},null,{"$f":"'CRM Master Calc'!G51","v":"Included"}]
[0,{"$f":"IF('CRM Master Calc'!B52=\"\",\"\",'CRM Master Calc'!B52)","v":""},{"$f":"IF('CRM Master Calc'!C52=\"\",\"\",'CRM Master Calc'!C52)","v":"Business Ready Enhancement Plan"},{"$f":"IF('CRM Master Calc'!D52=\"\",\"\",'CRM Master Calc'!D52)","v":0.16},{"$f":"IF('CRM Master Calc'!E52=\"\",\"\",'CRM Master Calc'!E52)","v":0},null,{"$f":"'CRM Master Calc'!G52","v":"Included"}]
[0,{"$f":"IF('CRM Master Calc'!B53=\"\",\"\",'CRM Master Calc'!B53)","v":""},{"$f":"IF('CRM Master Calc'!C53=\"\",\"\",'CRM Master Calc'!C53)","v":"Three Year Business Ready Enhancement Plan"},{"$f":"IF('CRM Master Calc'!D53=\"\",\"\",'CRM Master Calc'!D53)","v":0.16},{"$f":"IF('CRM Master Calc'!E53=\"\",\"\",'CRM Master Calc'!E53)","v":0},null,{"$f":"'CRM Master Calc'!G53","v":"Included"}]
[0,{"$f":"IF('CRM Master Calc'!B54=\"\",\"\",'CRM Master Calc'!B54)","v":""},{"$f":"IF('CRM Master Calc'!C54=\"\",\"\",'CRM Master Calc'!C54)","v":"Business Ready Advantage Plan"},{"$f":"IF('CRM Master Calc'!D54=\"\",\"\",'CRM Master Calc'!D54)","v":0.18},{"$f":"IF('CRM Master Calc'!E54=\"\",\"\",'CRM Master Calc'!E54)","v":0},null,{"$f":"'CRM Master Calc'!G54","v":"Included"}]
[0,{"$f":"IF('CRM Master Calc'!B55=\"\",\"\",'CRM Master Calc'!B55)","v":""},{"$f":"IF('CRM Master Calc'!C55=\"\",\"\",'CRM Master Calc'!C55)","v":"Business Ready Advantage Plus Plan"},{"$f":"IF('CRM Master Calc'!D55=\"\",\"\",'CRM Master Calc'!D55)","v":0.25},{"$f":"IF('CRM Master Calc'!E55=\"\",\"\",'CRM Master Calc'!E55)","v":0},null,{"$f":"'CRM Master Calc'!G55","v":"Included"}]
[0,{"$f":"IF('CRM Master Calc'!B56=\"\",\"\",'CRM Master Calc'!B56)","v":""},{"$f":"IF('CRM Master Calc'!C56=\"\",\"\",'CRM Master Calc'!C56)","v":"Three Year Business Ready Advantage Plan"},{"$f":"IF('CRM Master Calc'!D56=\"\",\"\",'CRM Master Calc'!D56)","v":0.18},{"$f":"IF('CRM Master Calc'!E56=\"\",\"\",'CRM Master Calc'!E56)","v":0},null,{"$f":"'CRM Master Calc'!G56","v":"Included"}]
[{"$f":"IF('CRM Master Calc'!A57=\"\",\"\",'CRM Master Calc'!A57)","v":"CRM Enhancement Fee Sub-Total"},null,null,null,{"$f":"IF('CRM Master Calc'!E57=\"\",\"\",'CRM Master Calc'!E57)","v":0},null,{"$f":"'CRM Master Calc'!G57","v":"Included"},null,"New License"]
["For more information on Service Plans Click Here",null,null,null,{"$f":"IF('CRM Master Calc'!E58=\"\",\"\",'CRM Master Calc'!E58)","v":""},null,{"$f":"'CRM Master Calc'!G58","v":"Included"}]
[{"$f":"IF('CRM Master Calc'!A59=\"\",\"\",'CRM Master Calc'!A59)","v":"CRM Total Fees"},null,null,null,{"$f":"IF('CRM Master Calc'!E59=\"\",\"\",'CRM Master Calc'!E59)","v":9994},null,{"$f":"'CRM Master Calc'!G59","v":"Included"}]
[null,null,null,null,null,null,{"$f":"'CRM Master Calc'!G60","v":"Included"}]
[null,null,null,null,null,null,{"$f":"'CRM Master Calc'!G61","v":"Included"}]
["* An Enhancement Plan is Required. ",null,null,null,null,null,{"$f":"'CRM Master Calc'!G62","v":"Included"}]
[null,null,null,null,null,null,{"$f":"'CRM Master Calc'!G63","v":"Included"}]
["Links to Partner Training:",null,null,null,null,null,{"$f":"'CRM Master Calc'!G64","v":"Included"}]
[null,"Microsoft Dynamics CRM 2011 Pricing and Licensing Training (On-Premise and SPLA)",null,null,null,null,{"$f":"'CRM Master Calc'!G65","v":"Included"}]
[null,null,null,null,null,null,{"$f":"'CRM Master Calc'!G66","v":"Included"}]
["System Requirements:",null,null,null,null,null,{"$f":"'CRM Master Calc'!G67","v":"Included"}]
[null,"Microsoft Dynamics CRM 2011 System Requirements and Required Components",null,null,null,null,{"$f":"'CRM Master Calc'!G68","v":"Included"}]
[null,null,null,null,null,null,{"$f":"'CRM Master Calc'!G69","v":"Included"}]
["CRM Orders with Dynamics ERP",null,null,null,null,null,{"$f":"'CRM Master Calc'!G70","v":"Included"}]
[null,"Customers that own Perpetual (NAV 2013, GP 2013), Business Value Licensing (AX 2012), the Business Ready Licensing Advanced Management edition, or the Module Based Licensing Professional edition of Microsoft Dynamics NAV, Microsoft Dynamics AX, Microsoft Dynamics GP, or Microsoft Dynamics SL receive their first Microsoft Dynamics CRM 2011 Server for free as long as they acquire it through Order Central.  This offer does not apply to purchases made through Volume Licensing",null,null,null,null,{"$f":"'CRM Master Calc'!G71","v":"Included"}]
[null,null,null,null,null,null,{"$f":"'CRM Master Calc'!G72","v":"Included"}]
["This document is intended for general information purposes only, and we have taken due care in its preparation. All embedded functionality used to facilitate price calculations is provided AS IS. Any risk arising from the use of the information shall rest with the recipient and nothing herein shall be construed as constituting any kind of warranty or representation, express, implied or statutory.  Users are responsible for information that is input using the pricing calculator embedded in the offline pricelist.  Under certain circumstances the figures resulting from the applied pricing calculations embedded in the price list, which are shown for your convenience in this pricelist, may differ from those reflected in the Order Summary Page in Order Central. In these scenarios, the figures shown in the Order Summary Page will control.",null,null,null,null,null,{"$f":"'CRM Master Calc'!G73","v":"Included"}]
[null,null,null,null,null,null,{"$f":"'CRM Master Calc'!G74","v":"Included"}]
["European Union/European Free Trade Association policy: Upward price adjustments due to currency alignment are not subject to the standard 90-day Solution Provider Agreement notification policy.  Notice of currency alignment changes will be published at least 30 days in advance of the effective date.  The Euro price list is the official price list for all reference purposes for customers located in the European Union/European Free Trade Association.  Microsoft’s European Operating Centre (EOC) supports five additional currencies for pricing purposes:  British Pound, Danish Krone, Norwegian Krone, Swedish Krona, and Swiss Franc.  Price lists reflected in these local currencies are listed for your convenience only.",null,null,null,null,null,{"$f":"'CRM Master Calc'!G75","v":"Not Included"}]
[{"$f":"IF('CRM Master Calc'!A76=\"\",\"\",'CRM Master Calc'!A76)","v":""},{"$f":"IF('CRM Master Calc'!B76=\"\",\"\",'CRM Master Calc'!B76)","v":""},{"$f":"IF('CRM Master Calc'!C76=\"\",\"\",'CRM Master Calc'!C76)","v":""},{"$f":"IF('CRM Master Calc'!D76=\"\",\"\",'CRM Master Calc'!D76)","v":""},{"$f":"IF('CRM Master Calc'!E76=\"\",\"\",'CRM Master Calc'!E76)","v":""},null,{"$f":"'CRM Master Calc'!G76","v":0}]
[{"$f":"IF('CRM Master Calc'!A77=\"\",\"\",'CRM Master Calc'!A77)","v":""},{"$f":"IF('CRM Master Calc'!B77=\"\",\"\",'CRM Master Calc'!B77)","v":""},{"$f":"IF('CRM Master Calc'!C77=\"\",\"\",'CRM Master Calc'!C77)","v":""},{"$f":"IF('CRM Master Calc'!D77=\"\",\"\",'CRM Master Calc'!D77)","v":""},{"$f":"IF('CRM Master Calc'!E77=\"\",\"\",'CRM Master Calc'!E77)","v":""},null,{"$f":"'CRM Master Calc'!G77","v":0}]
[{"$f":"IF('CRM Master Calc'!A78=\"\",\"\",'CRM Master Calc'!A78)","v":""},{"$f":"IF('CRM Master Calc'!B78=\"\",\"\",'CRM Master Calc'!B78)","v":""},{"$f":"IF('CRM Master Calc'!C78=\"\",\"\",'CRM Master Calc'!C78)","v":""},{"$f":"IF('CRM Master Calc'!D78=\"\",\"\",'CRM Master Calc'!D78)","v":""},{"$f":"IF('CRM Master Calc'!E78=\"\",\"\",'CRM Master Calc'!E78)","v":""},null,{"$f":"'CRM Master Calc'!G78","v":0}]
[{"$f":"IF('CRM Master Calc'!A79=\"\",\"\",'CRM Master Calc'!A79)","v":""},{"$f":"IF('CRM Master Calc'!B79=\"\",\"\",'CRM Master Calc'!B79)","v":""},{"$f":"IF('CRM Master Calc'!C79=\"\",\"\",'CRM Master Calc'!C79)","v":""},{"$f":"IF('CRM Master Calc'!D79=\"\",\"\",'CRM Master Calc'!D79)","v":""},{"$f":"IF('CRM Master Calc'!E79=\"\",\"\",'CRM Master Calc'!E79)","v":""},null,{"$f":"'CRM Master Calc'!G79","v":0}]
[{"$f":"IF('CRM Master Calc'!A80=\"\",\"\",'CRM Master Calc'!A80)","v":""},{"$f":"IF('CRM Master Calc'!B80=\"\",\"\",'CRM Master Calc'!B80)","v":""},{"$f":"IF('CRM Master Calc'!C80=\"\",\"\",'CRM Master Calc'!C80)","v":""},{"$f":"IF('CRM Master Calc'!D80=\"\",\"\",'CRM Master Calc'!D80)","v":""},{"$f":"IF('CRM Master Calc'!E80=\"\",\"\",'CRM Master Calc'!E80)","v":""},null,{"$f":"'CRM Master Calc'!G80","v":0}]
[{"$f":"IF('CRM Master Calc'!A81=\"\",\"\",'CRM Master Calc'!A81)","v":""},{"$f":"IF('CRM Master Calc'!B81=\"\",\"\",'CRM Master Calc'!B81)","v":""},{"$f":"IF('CRM Master Calc'!C81=\"\",\"\",'CRM Master Calc'!C81)","v":""},{"$f":"IF('CRM Master Calc'!D81=\"\",\"\",'CRM Master Calc'!D81)","v":""},{"$f":"IF('CRM Master Calc'!E81=\"\",\"\",'CRM Master Calc'!E81)","v":""},null,{"$f":"'CRM Master Calc'!G81","v":0}]
[{"$f":"IF('CRM Master Calc'!A82=\"\",\"\",'CRM Master Calc'!A82)","v":""},{"$f":"IF('CRM Master Calc'!B82=\"\",\"\",'CRM Master Calc'!B82)","v":""},{"$f":"IF('CRM Master Calc'!C82=\"\",\"\",'CRM Master Calc'!C82)","v":""},{"$f":"IF('CRM Master Calc'!D82=\"\",\"\",'CRM Master Calc'!D82)","v":""},{"$f":"IF('CRM Master Calc'!E82=\"\",\"\",'CRM Master Calc'!E82)","v":""},null,{"$f":"'CRM Master Calc'!G82","v":0}]
[{"$f":"IF('CRM Master Calc'!A83=\"\",\"\",'CRM Master Calc'!A83)","v":""},{"$f":"IF('CRM Master Calc'!B83=\"\",\"\",'CRM Master Calc'!B83)","v":""},{"$f":"IF('CRM Master Calc'!C83=\"\",\"\",'CRM Master Calc'!C83)","v":""},{"$f":"IF('CRM Master Calc'!D83=\"\",\"\",'CRM Master Calc'!D83)","v":""},{"$f":"IF('CRM Master Calc'!E83=\"\",\"\",'CRM Master Calc'!E83)","v":""},null,{"$f":"'CRM Master Calc'!G83","v":0}]
[{"$f":"IF('CRM Master Calc'!A84=\"\",\"\",'CRM Master Calc'!A84)","v":""},{"$f":"IF('CRM Master Calc'!B84=\"\",\"\",'CRM Master Calc'!B84)","v":""},{"$f":"IF('CRM Master Calc'!C84=\"\",\"\",'CRM Master Calc'!C84)","v":""},{"$f":"IF('CRM Master Calc'!D84=\"\",\"\",'CRM Master Calc'!D84)","v":""},{"$f":"IF('CRM Master Calc'!E84=\"\",\"\",'CRM Master Calc'!E84)","v":""},null,{"$f":"'CRM Master Calc'!G84","v":0}]
[{"$f":"IF('CRM Master Calc'!A85=\"\",\"\",'CRM Master Calc'!A85)","v":""},{"$f":"IF('CRM Master Calc'!B85=\"\",\"\",'CRM Master Calc'!B85)","v":""},{"$f":"IF('CRM Master Calc'!C85=\"\",\"\",'CRM Master Calc'!C85)","v":""},{"$f":"IF('CRM Master Calc'!D85=\"\",\"\",'CRM Master Calc'!D85)","v":""},{"$f":"IF('CRM Master Calc'!E85=\"\",\"\",'CRM Master Calc'!E85)","v":""},null,{"$f":"'CRM Master Calc'!G85","v":0}]
[{"$f":"IF('CRM Master Calc'!A86=\"\",\"\",'CRM Master Calc'!A86)","v":""},{"$f":"IF('CRM Master Calc'!B86=\"\",\"\",'CRM Master Calc'!B86)","v":""},{"$f":"IF('CRM Master Calc'!C86=\"\",\"\",'CRM Master Calc'!C86)","v":""},{"$f":"IF('CRM Master Calc'!D86=\"\",\"\",'CRM Master Calc'!D86)","v":""},{"$f":"IF('CRM Master Calc'!E86=\"\",\"\",'CRM Master Calc'!E86)","v":""}]

{"sheet":"GP Master Calc","index":6,"n_rows":44,"n_cols":18,"rows_kept":44,"cut":false,"hidden":true,"merged":[[7,8,7,16],[43,1,43,5],[42,1,42,5],[44,1,44,5],[38,1,38,4],[40,1,40,4],[30,3,30,4],[24,3,24,4],[15,3,15,4]]}
["Microsoft Dynamics GP 2013 Perpetual Licensing Model Price Lis"]
[]
["Customer Location:",null,"Partner Location:"]
[]
[null,null,null,null,{"$f":"CONCATENATE(\"Price List – Effective \", PUBLICATIONDATE)","v":"Price List – Effective April, 2013"}]
[null,null,null,null,"Microsoft Confidential"]
[null,null,null,null,null,"Total Value","** Localization Disclaimer **"]
[null,null,null,null,null,{"$f":"F41","v":13456},null,null,"PRICE LIST CREATION STUFF"]
["Qty","Item","Notes","SKU",{"$f":"SELECTEDCURRENCYCODE","v":"USD"},"Total","Prerequisites","Rowtype","LookUp","Publish Status","Country Status","Offering Status","Offering","usbase","Muliplier Applied","Std Multiplier","Ex Multiplier","Notes"]
[{"$f":"IF('Dynamics GP'!A8=\"\",\"\",'Dynamics GP'!A8)","v":""},{"$f":"IF(HLOOKUP(B$9,PriceLookup,$I10,FALSE)=\"\",\"\",HLOOKUP(B$9,PriceLookup,$I10,FALSE))","v":"ERP Solution Suite "},"","",{"$f":"IF(I10=\"\",\"\",\nIF(HLOOKUP(\"US Base Price\",PriceLookup,I10,FALSE)=\"OVERRIDE\",O10,\nIF(HLOOKUP(\"Rounding Rule\",PriceLookup,I10,FALSE)=-1,ROUND(N10*ROUND(O10,8)/-1,0)*-1,\nIF(HLOOKUP(\"Rounding Rule\",PriceLookup,I10,FALSE)=5,ROUND(N10*ROUND(O10,8)/5,0)*5,\nIF(HLOOKUP(\"Rounding Rule\",PriceLookup,I10,FALSE)=1,ROUND(N10*ROUND(O10,8)/1,0)*1,\n\"\")))))","v":""},{"$f":"IFERROR(SUM(E10*A10),\"\")","v":""},{"$f":"IF(HLOOKUP(G$9,PriceLookup,$I10,FALSE)=\"\",\"\",HLOOKUP(G$9,PriceLookup,$I10,FALSE))","v":""},{"$f":"HLOOKUP($H$9,PriceLookup,I10,FALSE)","v":"HEADING"},2,{"$f":"IF(COUNTIF(J11:J12,\"Included\")=0,\"Not Included\",\"Included\")","v":"Included"}]
[{"$f":"IF('Dynamics GP'!A9=\"\",\"\",'Dynamics GP'!A9)","v":1},"Starter Pack",null,109098612,5000,{"$f":"IFERROR(SUM(E11*A11),\"\")","v":5000},{"$f":"IF(HLOOKUP(G$9,PriceLookup,$I11,FALSE)=\"\",\"\",HLOOKUP(G$9,PriceLookup,$I11,FALSE))","v":"Starter Pack is the prerequisite for all items on price list"},{"$f":"HLOOKUP($H$9,PriceLookup,I11,FALSE)","v":"SKU"},3,{"$f":"IF(SUM(K11:L11)=2,\"Included\",\"Not Included\")","v":"Included"},{"$f":"IF(HLOOKUP(CUSTOMERLOCATION,AvailabilityLookUp,I11,FALSE)=1, 1,0)","v":1},{"$f":"IF(OR(SELECTEDOFFERING=M11,M11=\"\"),1,0)","v":1},{"$f":"HLOOKUP($M$9,PriceLookup,I11,FALSE)","v":"BRL-AM"},{"$f":"HLOOKUP(\"US Base Price\",PriceLookup,I11,FALSE)","v":5000},{"$f":"IF(N11=\"OVERRIDE\",Q11,\nIF(Q11=\"\",P11,Q11))","v":1},{"$f":"HLOOKUP(SELECTEDPRICEREGION,RegionStdMultiplier,2,FALSE)","v":1},{"$f":"IF(HLOOKUP(SELECTEDPRICEREGION,PriceLookup,I11,FALSE)=\"\",\"\",HLOOKUP(SELECTEDPRICEREGION,PriceLookup,I11,FALSE))","v":""}]
[{"$f":"IF('Dynamics GP'!A10=\"\",\"\",'Dynamics GP'!A10)","v":0},{"$f":"IF(HLOOKUP(B$9,PriceLookup,I12,FALSE)=\"\",\"\",HLOOKUP(B$9,PriceLookup,I12,FALSE))","v":"Extended Pack"},null,{"$f":"IF(HLOOKUP(D$9,PriceLookup,$I12,FALSE)=\"\",\"\",HLOOKUP(D$9,PriceLookup,$I12,FALSE))","v":109098613},10000,0,{"$f":"IF(HLOOKUP(G$9,PriceLookup,$I12,FALSE)=\"\",\"\",HLOOKUP(G$9,PriceLookup,$I12,FALSE))","v":""},{"$f":"HLOOKUP($H$9,PriceLookup,I12,FALSE)","v":"SKU"},4,{"$f":"IF(SUM(K12:L12)=2,\"Included\",\"Not Included\")","v":"Included"},{"$f":"IF(HLOOKUP(CUSTOMERLOCATION,AvailabilityLookUp,I12,FALSE)=1, 1,0)","v":1},{"$f":"IF(OR(SELECTEDOFFERING=M12,M12=\"\"),1,0)","v":1},{"$f":"HLOOKUP($M$9,PriceLookup,I12,FALSE)","v":"BRL-AM"},{"$f":"HLOOKUP(\"US Base Price\",PriceLookup,I12,FALSE)","v":10000},{"$f":"IF(N12=\"OVERRIDE\",Q12,\nIF(Q12=\"\",P12,Q12))","v":1},1,{"$f":"IF(HLOOKUP(SELECTEDPRICEREGION,PriceLookup,I12,FALSE)=\"\",\"\",HLOOKUP(SELECTEDPRICEREGION,PriceLookup,I12,FALSE))","v":""}]
[{"$f":"IF('Dynamics GP'!A11=\"\",\"\",'Dynamics GP'!A11)","v":""},"Users",{"$f":"IF(HLOOKUP(C$9,PriceLookup,$I13,FALSE)=\"\",\"\",HLOOKUP(C$9,PriceLookup,$I13,FALSE))","v":""},"","","",{"$f":"IF(HLOOKUP(G$9,PriceLookup,$I13,FALSE)=\"\",\"\",HLOOKUP(G$9,PriceLookup,$I13,FALSE))","v":""},{"$f":"HLOOKUP($H$9,PriceLookup,I13,FALSE)","v":"HEADING"},5,"Included"]
[{"$f":"IF('Dynamics GP'!A12=\"\",\"\",'Dynamics GP'!A12)","v":1},"Full User CAL (Concurrent User)",null,109098614,3000,3000,"","SKU",6,"Included",1,1,"BRL-AM",{"$f":"HLOOKUP(\"US Base Price\",PriceLookup,I14,FALSE)","v":3000},1,1,""]
[{"$f":"IF('Dynamics GP'!A13=\"\",\"\",'Dynamics GP'!A13)","v":6},"Limited User CAL (Concurrent User)","",109098616,600,3600,"","SKU",7,"Included",1,1,"BRL-AM",{"$f":"HLOOKUP(\"US Base Price\",PriceLookup,I15,FALSE)","v":600},1,1,""]
[null,null,null,"Sub Total of ERP Solution Suite & Users",null,{"$f":"SUM(F11:F15)","v":11600}]
[null,"Configuration and Development",null,"",null,null,"","HEADING",8,"Included"]
[{"$f":"IF('Dynamics GP'!A16=\"\",\"\",'Dynamics GP'!A16)","v":0},"Customization Pack","",109099124,{"$f":"IF(I18=\"\",\"\",\nIF(HLOOKUP(\"US Base Price\",PriceLookup,I18,FALSE)=\"OVERRIDE\",O18,\nIF(HLOOKUP(\"Rounding Rule\",PriceLookup,I18,FALSE)=-1,ROUND(N18*ROUND(O18,8)/-1,0)*-1,\nIF(HLOOKUP(\"Rounding Rule\",PriceLookup,I18,FALSE)=5,ROUND(N18*ROUND(O18,8)/5,0)*5,\nIF(HLOOKUP(\"Rounding Rule\",PriceLookup,I18,FALSE)=1,ROUND(N18*ROUND(O18,8)/1,0)*1,\n\"\")))))","v":6000},0,"","SKU",9,"Included",1,1,"BRL-AM",{"$f":"HLOOKUP(\"US Base Price\",PriceLookup,I18,FALSE)","v":6000},1,1,""]
[null,"Business Intelligence and Reporting","","",null,null,"","HEADING",10,"Included"]
[{"$f":"IF('Dynamics GP'!A18=\"\",\"\",'Dynamics GP'!A18)","v":0},"SmartList Builder Pack","",109100028,{"$f":"IF(I20=\"\",\"\",\nIF(HLOOKUP(\"US Base Price\",PriceLookup,I20,FALSE)=\"OVERRIDE\",O20,\nIF(HLOOKUP(\"Rounding Rule\",PriceLookup,I20,FALSE)=-1,ROUND(N20*ROUND(O20,8)/-1,0)*-1,\nIF(HLOOKUP(\"Rounding Rule\",PriceLookup,I20,FALSE)=5,ROUND(N20*ROUND(O20,8)/5,0)*5,\nIF(HLOOKUP(\"Rounding Rule\",PriceLookup,I20,FALSE)=1,ROUND(N20*ROUND(O20,8)/1,0)*1,\n\"\")))))","v":2000},{"$f":"IFERROR(SUM(E20*A20),\"\")","v":0},"",{"$f":"HLOOKUP($H$9,PriceLookup,I20,FALSE)","v":"SKU"},11,"Included",1,1,"BRL-AM",{"$f":"HLOOKUP(\"US Base Price\",PriceLookup,I20,FALSE)","v":2000},1,1,""]
[{"$f":"IF('Dynamics GP'!A19=\"\",\"\",'Dynamics GP'!A19)","v":""},"Human Resource Management",null,null,null,null,null,{"$f":"HLOOKUP($H$9,PriceLookup,I21,FALSE)","v":"HEADING"},12,"Included"]
[{"$f":"IF('Dynamics GP'!A20=\"\",\"\",'Dynamics GP'!A20)","v":0},"Extended Human Resources and Payroll ",{"$f":"IF(HLOOKUP(C$9,PriceLookup,$I22,FALSE)=\"\",\"\",HLOOKUP(C$9,PriceLookup,$I22,FALSE))","v":""},109100029,{"$f":"IF(I22=\"\",\"\",\nIF(HLOOKUP(\"US Base Price\",PriceLookup,I22,FALSE)=\"OVERRIDE\",O22,\nIF(HLOOKUP(\"Rounding Rule\",PriceLookup,I22,FALSE)=-1,ROUND(N22*ROUND(O22,8)/-1,0)*-1,\nIF(HLOOKUP(\"Rounding Rule\",PriceLookup,I22,FALSE)=5,ROUND(N22*ROUND(O22,8)/5,0)*5,\nIF(HLOOKUP(\"Rounding Rule\",PriceLookup,I22,FALSE)=1,ROUND(N22*ROUND(O22,8)/1,0)*1,\n\"\")))))","v":7000},{"$f":"IFERROR(SUM(E22*A22),\"\")","v":0},{"$f":"IF(HLOOKUP(G$9,PriceLookup,$I22,FALSE)=\"\",\"\",HLOOKUP(G$9,PriceLookup,$I22,FALSE))","v":""},{"$f":"HLOOKUP($H$9,PriceLookup,I22,FALSE)","v":"SKU"},13,"Included",1,1,"BRL-AM",{"$f":"HLOOKUP(\"US Base Price\",PriceLookup,I22,FALSE)","v":7000},1,1,""]
[null,"Financial Management","","",{"$f":"IF(I23=\"\",\"\",\nIF(HLOOKUP(\"US Base Price\",PriceLookup,I23,FALSE)=\"OVERRIDE\",O23,\nIF(HLOOKUP(\"Rounding Rule\",PriceLookup,I23,FALSE)=-1,ROUND(N23*ROUND(O23,8)/-1,0)*-1,\nIF(HLOOKUP(\"Rounding Rule\",PriceLookup,I23,FALSE)=5,ROUND(N23*ROUND(O23,8)/5,0)*5,\nIF(HLOOKUP(\"Rounding Rule\",PriceLookup,I23,FALSE)=1,ROUND(N23*ROUND(O23,8)/1,0)*1,\n\"\")))))","v":""},{"$f":"IFERROR(SUM(E23*A23),\"\")","v":""},{"$f":"IF(HLOOKUP(G$9,PriceLookup,$I23,FALSE)=\"\",\"\",HLOOKUP(G$9,PriceLookup,$I23,FALSE))","v":""},{"$f":"HLOOKUP($H$9,PriceLookup,I23,FALSE)","v":"HEADING"},14,"Included"]
[{"$f":"IF('Dynamics GP'!A22=\"\",\"\",'Dynamics GP'!A22)","v":0},"Collections Management","",109100859,{"$f":"IF(I24=\"\",\"\",\nIF(HLOOKUP(\"US Base Price\",PriceLookup,I24,FALSE)=\"OVERRIDE\",O24,\nIF(HLOOKUP(\"Rounding Rule\",PriceLookup,I24,FALSE)=-1,ROUND(N24*ROUND(O24,8)/-1,0)*-1,\nIF(HLOOKUP(\"Rounding Rule\",PriceLookup,I24,FALSE)=5,ROUND(N24*ROUND(O24,8)/5,0)*5,\nIF(HLOOKUP(\"Rounding Rule\",PriceLookup,I24,FALSE)=1,ROUND(N24*ROUND(O24,8)/1,0)*1,\n\"\")))))","v":3500},{"$f":"IFERROR(SUM(E24*A24),\"\")","v":0},{"$f":"IF(HLOOKUP(G$9,PriceLookup,$I24,FALSE)=\"\",\"\",HLOOKUP(G$9,PriceLookup,$I24,FALSE))","v":""},{"$f":"HLOOKUP($H$9,PriceLookup,I24,FALSE)","v":"SKU"},15,"Included",1,1,"BRL-AM",{"$f":"HLOOKUP(\"US Base Price\",PriceLookup,I24,FALSE)","v":3500},1,1,""]
[{"$f":"IF('Dynamics GP'!A23=\"\",\"\",'Dynamics GP'!A23)","v":""},null,null,"Sub Total of A La Carte",null,{"$f":"SUM(F18:F24)","v":0},null,null,null,"Included"]
[null,{"$f":"IF(HLOOKUP(B$9,PriceLookup,I26,FALSE)=\"\",\"\",HLOOKUP(B$9,PriceLookup,I26,FALSE))","v":"Database"},{"$f":"IF(HLOOKUP(C$9,PriceLookup,$I26,FALSE)=\"\",\"\",HLOOKUP(C$9,PriceLookup,$I26,FALSE))","v":""},"See Note",{"$f":"IF(I26=\"\",\"\",\nIF(HLOOKUP(\"US Base Price\",PriceLookup,I26,FALSE)=\"OVERRIDE\",O26,\nIF(HLOOKUP(\"Rounding Rule\",PriceLookup,I26,FALSE)=-1,ROUND(N26*ROUND(O26,8)/-1,0)*-1,\nIF(HLOOKUP(\"Rounding Rule\",PriceLookup,I26,FALSE)=5,ROUND(N26*ROUND(O26,8)/5,0)*5,\nIF(HLOOKUP(\"Rounding Rule\",PriceLookup,I26,FALSE)=1,ROUND(N26*ROUND(O26,8)/1,0)*1,\n\"\")))))","v":""},{"$f":"IFERROR(SUM(E26*A26),\"\")","v":""},{"$f":"IF(HLOOKUP(G$9,PriceLookup,$I26,FALSE)=\"\",\"\",HLOOKUP(G$9,PriceLookup,$I26,FALSE))","v":""},{"$f":"HLOOKUP($H$9,PriceLookup,I26,FALSE)","v":"HEADING"},16,{"$f":"IF(COUNTIF(J27:J30,\"Included\")=0,\"Not Included\",\"Included\")","v":"Included"}]
[{"$f":"IF('Dynamics GP'!A25=\"\",\"\",'Dynamics GP'!A25)","v":0},{"$f":"IF(HLOOKUP(B$9,PriceLookup,I27,FALSE)=\"\",\"\",HLOOKUP(B$9,PriceLookup,I27,FALSE))","v":"Microsoft® SQL Server® 2008 R2  Standard Edition Runtime Server License  (English)"},"",109100716,{"$f":"IF(I27=\"\",\"\",\nIF(HLOOKUP(\"US Base Price\",PriceLookup,I27,FALSE)=\"OVERRIDE\",O27,\nIF(HLOOKUP(\"Rounding Rule\",PriceLookup,I27,FALSE)=-1,ROUND(N27*ROUND(O27,8)/-1,0)*-1,\nIF(HLOOKUP(\"Rounding Rule\",PriceLookup,I27,FALSE)=5,ROUND(N27*ROUND(O27,8)/5,0)*5,\nIF(HLOOKUP(\"Rounding Rule\",PriceLookup,I27,FALSE)=1,ROUND(N27*ROUND(O27,8)/1,0)*1,\n\"\")))))","v":6},{"$f":"IFERROR(SUM(E27*A27),\"\")","v":0},{"$f":"IF(HLOOKUP(G$9,PriceLookup,$I27,FALSE)=\"\",\"\",HLOOKUP(G$9,PriceLookup,$I27,FALSE))","v":""},{"$f":"HLOOKUP($H$9,PriceLookup,I27,FALSE)","v":"SKU"},20,"Included",1,1,"BRL-AM",{"$f":"HLOOKUP(\"US Base Price\",PriceLookup,I27,FALSE)","v":6},1,1,1]
[{"$f":"IF('Dynamics GP'!A26=\"\",\"\",'Dynamics GP'!A26)","v":0},{"$f":"IF(HLOOKUP(B$9,PriceLookup,I28,FALSE)=\"\",\"\",HLOOKUP(B$9,PriceLookup,I28,FALSE))","v":"Microsoft® SQL Server® 2008 R2  Standard Edition Runtime CAL (English)"},"",109100717,{"$f":"IF(I28=\"\",\"\",\nIF(HLOOKUP(\"US Base Price\",PriceLookup,I28,FALSE)=\"OVERRIDE\",O28,\nIF(HLOOKUP(\"Rounding Rule\",PriceLookup,I28,FALSE)=-1,ROUND(N28*ROUND(O28,8)/-1,0)*-1,\nIF(HLOOKUP(\"Rounding Rule\",PriceLookup,I28,FALSE)=5,ROUND(N28*ROUND(O28,8)/5,0)*5,\nIF(HLOOKUP(\"Rounding Rule\",PriceLookup,I28,FALSE)=1,ROUND(N28*ROUND(O28,8)/1,0)*1,\n\"\")))))","v":110},{"$f":"IFERROR(SUM(E28*A28),\"\")","v":0},{"$f":"IF(HLOOKUP(G$9,PriceLookup,$I28,FALSE)=\"\",\"\",HLOOKUP(G$9,PriceLookup,$I28,FALSE))","v":"Microsoft® SQL Server® 2008 R2  Standard Edition Runtime Server License - See note C24"},{"$f":"HLOOKUP($H$9,PriceLookup,I28,FALSE)","v":"SKU"},17,"Included",1,1,"BRL-AM",{"$f":"HLOOKUP(\"US Base Price\",PriceLookup,I28,FALSE)","v":110},1,1,1]
[{"$f":"IF('Dynamics GP'!A27=\"\",\"\",'Dynamics GP'!A27)","v":0},{"$f":"IF(HLOOKUP(B$9,PriceLookup,I29,FALSE)=\"\",\"\",HLOOKUP(B$9,PriceLookup,I29,FALSE))","v":"Microsoft® SQL Server® 2008 R2  Enterprise Edition Runtime Server License (English)"},"",109100703,{"$f":"IF(I29=\"\",\"\",\nIF(HLOOKUP(\"US Base Price\",PriceLookup,I29,FALSE)=\"OVERRIDE\",O29,\nIF(HLOOKUP(\"Rounding Rule\",PriceLookup,I29,FALSE)=-1,ROUND(N29*ROUND(O29,8)/-1,0)*-1,\nIF(HLOOKUP(\"Rounding Rule\",PriceLookup,I29,FALSE)=5,ROUND(N29*ROUND(O29,8)/5,0)*5,\nIF(HLOOKUP(\"Rounding Rule\",PriceLookup,I29,FALSE)=1,ROUND(N29*ROUND(O29,8)/1,0)*1,\n\"\")))))","v":51},{"$f":"IFERROR(SUM(E29*A29),\"\")","v":0},{"$f":"IF(HLOOKUP(G$9,PriceLookup,$I29,FALSE)=\"\",\"\",HLOOKUP(G$9,PriceLookup,$I29,FALSE))","v":""},{"$f":"HLOOKUP($H$9,PriceLookup,I29,FALSE)","v":"SKU"},19,"Included",1,1,"BRL-AM",{"$f":"HLOOKUP(\"US Base Price\",PriceLookup,I29,FALSE)","v":51},1,1,1]
[{"$f":"IF('Dynamics GP'!A28=\"\",\"\",'Dynamics GP'!A28)","v":0},{"$f":"IF(HLOOKUP(B$9,PriceLookup,I30,FALSE)=\"\",\"\",HLOOKUP(B$9,PriceLookup,I30,FALSE))","v":"Microsoft® SQL Server® 2008 R2  Enterprise Edition Runtime CAL  (English)"},"",109100709,{"$f":"IF(I30=\"\",\"\",\nIF(HLOOKUP(\"US Base Price\",PriceLookup,I30,FALSE)=\"OVERRIDE\",O30,\nIF(HLOOKUP(\"Rounding Rule\",PriceLookup,I30,FALSE)=-1,ROUND(N30*ROUND(O30,8)/-1,0)*-1,\nIF(HLOOKUP(\"Rounding Rule\",PriceLookup,I30,FALSE)=5,ROUND(N30*ROUND(O30,8)/5,0)*5,\nIF(HLOOKUP(\"Rounding Rule\",PriceLookup,I30,FALSE)=1,ROUND(N30*ROUND(O30,8)/1,0)*1,\n\"\")))))","v":200},{"$f":"IFERROR(SUM(E30*A30),\"\")","v":0},{"$f":"IF(HLOOKUP(G$9,PriceLookup,$I30,FALSE)=\"\",\"\",HLOOKUP(G$9,PriceLookup,$I30,FALSE))","v":"Microsoft® SQL Server® 2008 R2  Enterprise Edition Runtime Server License - See note C24"},{"$f":"HLOOKUP($H$9,PriceLookup,I30,FALSE)","v":"SKU"},18,"Included",1,1,"BRL-AM",{"$f":"HLOOKUP(\"US Base Price\",PriceLookup,I30,FALSE)","v":200},1,1,1]
[{"$f":"IF('Dynamics GP'!A29=\"\",\"\",'Dynamics GP'!A29)","v":""},null,null,"Sub Total of Database",null,{"$f":"SUM(F27:F30)","v":0},null,null,null,{"$f":"IF(COUNTIF(J27:J30,\"Included\")=0,\"Not Included\",\"Included\")","v":"Included"}]
[{"$f":"IF('Dynamics GP'!A30=\"\",\"\",'Dynamics GP'!A30)","v":""},{"$f":"IF(HLOOKUP(B$9,PriceLookup,I32,FALSE)=\"\",\"\",HLOOKUP(B$9,PriceLookup,I32,FALSE))","v":"Service Plans"},{"$f":"IF(HLOOKUP(C$9,PriceLookup,$I32,FALSE)=\"\",\"\",HLOOKUP(C$9,PriceLookup,$I32,FALSE))","v":""},"",{"$f":"IF(I32=\"\",\"\",\nIF(HLOOKUP(\"US Base Price\",PriceLookup,I32,FALSE)=\"OVERRIDE\",O32,\nIF(HLOOKUP(\"Rounding Rule\",PriceLookup,I32,FALSE)=-1,ROUND(N32*ROUND(O32,8)/-1,0)*-1,\nIF(HLOOKUP(\"Rounding Rule\",PriceLookup,I32,FALSE)=5,ROUND(N32*ROUND(O32,8)/5,0)*5,\nIF(HLOOKUP(\"Rounding Rule\",PriceLookup,I32,FALSE)=1,ROUND(N32*ROUND(O32,8)/1,0)*1,\n\"\")))))","v":""},{"$f":"IFERROR(SUM(E32*A32),\"\")","v":""},{"$f":"IF(HLOOKUP(G$9,PriceLookup,$I32,FALSE)=\"\",\"\",HLOOKUP(G$9,PriceLookup,$I32,FALSE))","v":""},{"$f":"HLOOKUP($H$9,PriceLookup,I32,FALSE)","v":"HEADING"},21,"Included"]
[{"$f":"IF('Dynamics GP'!A31=\"\",\"\",'Dynamics GP'!A31)","v":0},"Enhancement Plan","","","",{"$f":"IFERROR(ROUND(SUM(E33*A33)*($F$16+$F$25+$F$31),1),0)","v":0},"","SKU",22,"Not Included",0,1,"BRL-AM",{"$f":"HLOOKUP(\"US Base Price\",PriceLookup,I33,FALSE)","v":"OVERRIDE"},"",1,""]
[{"$f":"IF('Dynamics GP'!A32=\"\",\"\",'Dynamics GP'!A32)","v":1},"Three Year Business Ready Enhancement Plan","","",0.16,{"$f":"IFERROR(ROUND(SUM(E34*A34)*($F$16+$F$25+$F$31),1),0)","v":1856},"","SKU",23,"Included",1,1,"BRL-AM","OVERRIDE",0.16,1,0.16]
[{"$f":"IF('Dynamics GP'!A33=\"\",\"\",'Dynamics GP'!A33)","v":0},"Business Ready Enhancement Plus Plan (LATAM)","","","",0,"","SKU",24,"Not Included",0,1,"BRL-AM","OVERRIDE","",1,""]
[{"$f":"IF('Dynamics GP'!A34=\"\",\"\",'Dynamics GP'!A34)","v":0},"Business Ready Advantage Plan","","",0.18,0,"","SKU",25,"Included",1,1,"BRL-AM","OVERRIDE",0.18,1,0.18]
[{"$f":"IF('Dynamics GP'!A35=\"\",\"\",'Dynamics GP'!A35)","v":0},"Three Year Business Ready Advantage Plan","","",0.18,{"$f":"IFERROR(ROUND(SUM(E37*A37)*($F$16+$F$25+$F$31),1),0)","v":0},"","SKU",26,{"$f":"IF(SUM(K37:L37)=2,\"Included\",\"Not Included\")","v":"Included"},{"$f":"IF(HLOOKUP(CUSTOMERLOCATION,AvailabilityLookUp,I37,FALSE)=1, 1,0)","v":1},{"$f":"IF(OR(SELECTEDOFFERING=M37,M37=\"\"),1,0)","v":1},{"$f":"HLOOKUP($M$9,PriceLookup,I37,FALSE)","v":"BRL-AM"},"OVERRIDE",{"$f":"IF(N37=\"OVERRIDE\",Q37,\nIF(Q37=\"\",P37,Q37))","v":0.18},1,{"$f":"IF(HLOOKUP(SELECTEDPRICEREGION,PriceLookup,I37,FALSE)=\"\",\"\",HLOOKUP(SELECTEDPRICEREGION,PriceLookup,I37,FALSE))","v":0.18}]
[{"$f":"IF('Dynamics GP'!A36=\"\",\"\",'Dynamics GP'!A36)","v":0},"Business Ready Advantage Plus Plan","","",0.25,0,"","SKU",27,"Included",1,1,"BRL-AM","OVERRIDE",0.25,1,0.25]
[null,"Total Enchancement",null,null,null,{"$f":"ROUND(SUM(F33:F38),0)","v":1856},null,null,null,"Included"]
[null,null,null,null,null,null,null,null,null,"Included"]
[null,"Total Solution Cost",null,null,null,{"$f":"ROUND(SUM(F16+F25+F31+F39),0)","v":13456},null,null,null,"Included"]
[null,null,null,null,null,null,null,null,null,"Included"]
[null,"This document is intended for general information purposes only, and we have taken due care in its preparation. All embedded functionality used to facilitate price calculations is provided AS IS. Any risk arising from the use of the information shall rest with the recipient and nothing herein shall be construed as constituting any kind of warranty or representation, express, implied or statutory.  Users are responsible for information that is input using the pricing calculator embedded in the offline pricelist.  Under certain circumstances the figures resulting from the applied pricing calculations embedded in the price list, which are shown for your convenience in this pricelist, may differ from those reflected in the Order Summary Page in Order Central. In these scenarios, the figures shown in the Order Summary Page will control.",null,null,null,null,null,null,null,"Included"]
[null,"European Union/European Free Trade Association policy: Upward price adjustments due to currency alignment are not subject to the standard 90-day Solution Provider Agreement notification policy.  Notice of currency alignment changes will be published at least 30 days in advance of the effective date.  The Euro price list is the official price list for all reference purposes for customers located in the European Union/European Free Trade Association.  Microsoft’s European Operating Centre (EOC) supports five additional currencies for pricing purposes:  British Pound, Danish Krone, Norwegian Krone, Swedish Krona, and Swiss Franc.  Price lists reflected in these local currencies are listed for your convenience only.",null,null,null,null,null,"",null,{"$f":"IF('GP FuseBox'!D6=\"yes\",\"Included\",\"Not Included\")","v":"Not Included"}]

{"sheet":"Extract","index":7,"n_rows":1,"n_cols":19,"rows_kept":1,"cut":false,"hidden":true,"merged":[]}
["PriceList","Country","DPLpriceregion","OfferingCode","SKUDescription","GranuleID","SKUID","Price","Currency","Prerequisite","Date","CountryCode","CountryVersion","CurrencyCode","ConversionFactor","CurrentRelease","OfferingName","DisplayID","ExtractDateTime"]

{"sheet":"GP FuseBox","index":8,"n_rows":46,"n_cols":5,"rows_kept":46,"cut":false,"hidden":true,"merged":[[17,1,18,1]]}
[]
[null,"CRITERION","VALUE 1","VALUE 2","Notes"]
[null,"Customer Location","United States"]
[null,"Cust Country Lookup"]
[null,"Cust Country Code",{"$f":"VLOOKUP(C3,COUNTRYLIST,2,FALSE)","v":227},{"$f":"IF(VLOOKUP(CUSTOMERLOCATION,COUNTRYLIST,6,FALSE)=TRUE,\"Excluded\",\"\")","v":""},"Checks for Excluded Country"]
[null,"Display PartnerBox?",{"$f":"IF(VLOOKUP(C3,COUNTRYLIST,7,FALSE) = TRUE,\"EEAS\",\"\")","v":""},{"$f":"IFERROR(IF(VLOOKUP(C3,COUNTRYLIST,7,FALSE)=TRUE, \"Yes\",\"No\"),\"No\")","v":"No"},"Checks for EEAS Country and drives partner box display"]
[null,"Customer Region",{"$f":"VLOOKUP(C3,COUNTRYLIST,3,FALSE)","v":"United States"},{"$f":"VLOOKUP(C3,COUNTRYLIST,5,FALSE)","v":"USD"},"Region name & Region currency"]
[null,"Cust Region Code",{"$f":"VLOOKUP(C3,COUNTRYLIST,4,FALSE)","v":25}]
[null,"Cust Region Lookup",{"$f":"C8","v":25}]
[null,"Partner Location",null,{"$f":"IF(C10=\"\",C3,C10)","v":"United States"}]
[null,"Ptnr Country Lookup"]
[null,"Ptnr Country Code",{"$f":"IFERROR(VLOOKUP(C10,COUNTRYLIST,2,FALSE),\"\")","v":""},{"$f":"IFERROR(IF(AND(PARTNERLOCATION<>\"\",VLOOKUP(D10,COUNTRYLIST,6,FALSE)=TRUE),\"Excluded\",\"\"),\"\")","v":""},"Checks for Excluded Country"]
[null,"Partner Region",{"$f":"IFERROR(VLOOKUP(C10,COUNTRYLIST,3,FALSE),\"\")","v":""},{"$f":"IFERROR(VLOOKUP(C10,COUNTRYLIST,5,FALSE),\"\")","v":""}]
[null,"Ptnr Region Code",{"$f":"IFERROR(VLOOKUP(C10,COUNTRYLIST,4,FALSE),\"\")","v":""}]
[null,"Ptnr Region Lookup",{"$f":"IFERROR(C14,\"\")","v":""}]
[null,"Display CurrencyBox?",{"$f":"IF(C12=\"\",\"\",\nIF(VLOOKUP(C10,COUNTRYLIST,8,FALSE)=TRUE,\"Group A\",\"\"))","v":""},{"$f":"IFERROR(IF(D6=\"No\",\"No\",\nIF(C16=\"Group A\",\"Yes\",\"No\")),\"No\")","v":"No"},"Checks for Group A and drives currency box"]
[null,"Currency Override?",{"$f":"IF(C16=\"Group A\",\"Yes\",\"No\")","v":"No"}]
[null,"CurrencyBox List",{"$f":"VLOOKUP(D18,CURRENCYLIST,2,FALSE)","v":"US Dollar"},{"$f":"IF(D6=\"No\",D7,\"EUR\")","v":"USD"},"This is the customer's currency. HOWEVER if partner location is in Group A then defaults to Euro"]
[null,null,{"$f":"VLOOKUP(D19,CURRENCYLIST,2,FALSE)","v":"US Dollar"},{"$f":"IF(D6=\"No\",D7,D13)","v":"USD"},"This is the partners currency. If no partner box then defaults to customer currency. If currency override uses EUR"]
[null,"Currency Selected","US Dollar",{"$f":"IF(AND(C6=\"EEAS\",D10=\"Please select Partner location...\"),\"Customer\",\nIF(AND(C6=\"EEAS\",C17=\"No\"),\"Customer\",\nIF(AND(C6=\"EEAS\",C17=\"Yes\",C20=C19),\"Partner\",\n\"Customer\")))","v":"Customer"},"Indicates which menu selection to use and displays chosen currency"]
[null,"Pricing to use?",{"$f":"IF(AND(C6=\"EEAS\",D10=\"Please select Partner location...\"),\"EUR\",\nIF(AND(C6=\"EEAS\",C17=\"No\"),\"EUR\",\nIF(AND(C6=\"EEAS\",C17=\"Yes\",D21=\"\"),\"EUR\",\nD19)))","v":"USD"},{"$f":"IF(AND(C6=\"EEAS\",C17=\"Yes\",C20=C19),\"DD Override\",\"\")","v":""},"\"DD Override\" changes currency in C21 (used in MasterCalc) to dropdown value"]
[null,"Price List Selected",{"$f":"IF(AND(D20=\"Customer\",D18=\"EUR\"),26,\nIF(AND(D20=\"Customer\",D18<>\"EUR\"),CUSTOMERREGIONLOOKUP,\nIF(D20=\"Partner\",C15,\n286+1)))","v":25},null,"Points to price list. Eurozone = 26"]
[null,"PriceRegionSelected",{"$f":"IF(C8=C22,CUSTOMERREGION,\nIF(SELECTEDCURRENCYCODE=\"EUR\",\"EUROZONE\",SELECTEDPARTNERREGION\n))","v":"United States"},null,"This displays the PriceRegion to look up for pricing. Will either be Customer Region, Partner region or EuroZone "]
[null,null,null,null,"Logic"]
[null,null,null,"1)","If cust is EEAS and \"Select\" message displayed, then EUR"]
[null,null,null,"2)","If Cust is EEAS and partner chosen with no override then EUR"]
[null,"Selected Offering","BRL-AM","1)","If Cust is EEAS and partner chosen with override then default EUR with option to select "]
[null,"Selected Discount","None","2)","if Cust currency = dropdown value then…"]
[null,"Selected Discount Amt",{"$f":"IF(C30=TRUE,VLOOKUP(SELECTEDDISCOUNT,GVADISCOUNTLIST,3,FALSE),0)","v":0},"1)","if Partner currency = dropdown value then…"]
[null,"Apply Discount?",{"$f":"IFERROR(IF(SEARCH(\"BRL\",SELECTEDOFFERING),TRUE),FALSE)","v":true},"2)","Discount only applied to BRL so if MBL then answer is no"]
[]
[null,"Pricelist Month",{"$f":"PricelistMonth","v":"April"},null,"Pricelist Month selected on Admin Control Page"]
[null,"Pricelist Year",{"$f":"Pricelistyear","v":2013},null,"Pricelist year selected on Admin Control Page"]
[null,"Publication Date",{"$f":"CONCATENATE(C32,\", \",C33)","v":"April, 2013"},null,"Current Publication Date"]
[null,"Full PubDate",{"$f":"DATEVALUE(CONCATENATE(1,\"/\",C32,\"/\",C33))","v":"2013-04-01"},null,"Used with Extract Tool"]
[]
[null,"Customer Loc Excluded ?",{"$f":"IFERROR(VLOOKUP(CUSTOMERLOCATION,EXCOUNTRYLIST,1,FALSE),FALSE)","v":false},null,"Is Customer Location chosen  an excluded country."]
[null,"Partner Loc Excluded ?",{"$f":"IFERROR(VLOOKUP(PARTNERLOCATION,EXCOUNTRYLIST,1,FALSE),FALSE)","v":false},null,"Is Partner Location chosen  an excluded country."]
[null,"Pricelist Excluded Status",{"$f":"IF(OR(C37<>FALSE,C38<>FALSE),TRUE,FALSE)","v":false},null,"Tests if either Customer or Partner Location chosen is an excluded country. If TRUE then all pricerows on mastercalc set to NOTINCLUDE"]
[]
[null,"Row Count",{"$f":"COUNT('GP Master Calc'!I:I)","v":26},null,"Used with Extract Tool"]
[]
[]
[null,"Turn on Order Form",true,null,"shows the status of the Order form toggle on the control page TRUE = ON / FALSE = OFF"]
[]
[null,"ExtractCount",{"$f":"COUNTA(Table131[Customer Location])-1","v":239},null,"Shows the number of lines required for the extract loop based on the number of rows in the ExtractList table"]

{"sheet":"GP Product Data","index":9,"n_rows":243,"n_cols":59,"rows_kept":243,"cut":false,"hidden":true,"merged":[[1,42,1,44],[1,52,1,53],[1,46,1,47],[1,55,1,58]]}
[]
[null,null,null,null,null,null,null,null,null,"Lookup",1,2,3,4,5,6,7,8,9,10,11,12,13,14,15,16,17,18,19,20,21,22,23,24,25,26,27,28,29,30,31,null,"ROUNDING RULES LIST",null,null,null,"GVA DISCOUNT LIST",null,null,null,"LANGUAGES LIST",null,"OFFERING LIST",null,null,"EXTRACT LIST"]
[null,null,null,null,null,null,null,null,null,"Region","Africa","APOC United States","Australia","Canada","Central Asia 1 - CEE 1","Central Asia 2 - CEE 2","Chile","China","Colombia","Eastern Europe 1","Eastern Europe 2","India","Japan","Latam Caribbean","Latam PR/BM/CI/VI","Mexico","Middle East","New Zealand","Rest of Latam","Russia","Serbia","South Africa","South East Asia","Turkey","United States","Eurozone","Denmark2","Norway2","Sweden2","Switzerland2","United Kingdom2",null,"Rule","Rounding Rule list","Driver",null,"GVA Type","GVACode","Discount",null,"LANGUAGES LIST",null,"OFFERING NAME","OFFERING CODE",null,"Customer Location","Partner Location","currency","Offering"]
[null,null,null,null,null,null,null,null,null,"Std Multiplier",0.7,1,1,1,0.9,0.9,0.7,6.5,0.7,0.9,0.9,34.65,83,0.7,1,0.7,0.9,1.3,0.7,31.5,0.9,0.9,0.7,0.9,1,0.75,5.5834000000000001,5.8009000000000004,6.8605999999999998,0.90510000000000002,0.59179999999999999,null,1,"Round up to nearest whole number",1,null,"None",1,null,null,"Please select required language here:",null,"Business Ready Licensing - Advanced Management Edition","BRL-AM",null,"Afghanistan","United States","US Dollar","BRL-AM"]
["Lookup",1,2,3,4,5,6,null,7,8,9,10,11,12,13,14,15,16,17,18,19,20,21,22,23,24,25,26,27,28,29,30,31,32,33,34,35,36,37,38,39,null,2,"Round to nearest whole 5",5,null,"Multi-site Agreement Tier D",2,0.25,null,"Afrikaans-4935 - Category 3",null,"Business Ready Licensing - Business Essentials Edition","BRL-BE",null,"Albania","United States","US Dollar","BRL-AM"]
[1,"SKU","Item","Offering","OC Module name ","Notes","Prerequisites","RowType","US Base Price","Rounding Rule","Africa","APOC United States","Australia","Canada","Central Asia 1 - CEE 1","Central Asia 2 - CEE 2","Chile","China","Colombia","Eastern Europe 1","Eastern Europe 2","India","Japan","Latam Caribbean","Latam PR/BM/CI/VI","Mexico","Middle East","New Zealand","Rest of Latam","Russia","Serbia","South Africa","South East Asia","Turkey","United States","Eurozone","Denmark2","Norway2","Sweden2","Switzerland2","United Kingdom2",null,3,"Round to nearest 2 decimal places",-1,null,"Multi-site Agreement Tier E",3,0.35,null,"Albanian-4936 - Category 3",null,"Module Based Licensing - Professional (Existing Customers Only)","MBL-Pro",null,"Algeria","United States","US Dollar","BRL-AM"]
[2,null,"ERP Solution Suite ",null,null,null,null,{"$f":"IF(AND(C7<>\"\",PRODUCTINFOTABLE[[#This Row],[US Base Price]]<>\"\"),\"SKU\",\"HEADING\")","v":"HEADING"},null,null,null,null,null,null,null,null,null,null,null,null,null,null,null,null,null,null,null,null,null,null,null,null,null,null,null,null,null,null,null,null,null,null,null,null,null,null,"Multi-site Agreement Tier F",4,0.4,null,"Arabic (Algeria)-4937 - Category 3",null,"Module Based Licensing - Standard (Existing Customers Only)","MBL-Std",null,"American Samoa","United States","US Dollar","BRL-AM"]
[3,109098612,"Starter Pack","BRL-AM",null,null,"Starter Pack is the prerequisite for all items on price list",{"$f":"IF(AND(C8<>\"\",PRODUCTINFOTABLE[[#This Row],[US Base Price]]<>\"\"),\"SKU\",\"HEADING\")","v":"SKU"},5000,1,null,null,null,null,null,null,null,null,null,null,null,null,null,null,null,null,null,null,null,null,null,null,null,null,null,null,null,null,null,null,null,null,null,null,null,null,"Multi-site Agreement Tier G",5,0.45,null,"Arabic (Bahrain)-4938 - Category 3",null,null,null,null,"Andorra","Austria","Euro","BRL-AM"]
[4,109098613,"Extended Pack","BRL-AM",null,null,null,{"$f":"IF(AND(C9<>\"\",PRODUCTINFOTABLE[[#This Row],[US Base Price]]<>\"\"),\"SKU\",\"HEADING\")","v":"SKU"},10000,1,null,null,null,null,null,null,null,null,null,null,null,null,null,null,null,null,null,null,null,null,null,null,null,null,null,null,null,null,null,null,null,null,null,null,null,null,"Multi-site Agreement Tier H",6,0.5,null,"Arabic (Egypt)-4939 - Category 3",null,null,null,null,"Angola","United States","US Dollar","BRL-AM"]
[5,null,"Users",null,null,null,null,{"$f":"IF(AND(C10<>\"\",PRODUCTINFOTABLE[[#This Row],[US Base Price]]<>\"\"),\"SKU\",\"HEADING\")","v":"HEADING"},null,null,null,null,null,null,null,null,null,null,null,null,null,null,null,null,null,null,null,null,null,null,null,null,null,null,null,null,null,null,null,null,null,null,null,null,null,null,"Multi-site Agreement Tier I",7,0.55000000000000004,null,"Arabic (Iraq)-4940 - Category 3",null,null,null,null,"Anguilla","United States","US Dollar","BRL-AM"]
[6,109098614,"Full User CAL (Concurrent User)","BRL-AM",null,null,null,{"$f":"IF(AND(C11<>\"\",PRODUCTINFOTABLE[[#This Row],[US Base Price]]<>\"\"),\"SKU\",\"HEADING\")","v":"SKU"},3000,1,null,null,null,null,null,null,null,null,null,null,null,null,null,null,null,null,null,null,null,null,null,null,null,null,null,null,null,null,null,null,null,null,null,null,null,null,"Global Volume Agreement Tier F",8,0.4,null,"Arabic (Jordan)-4941 - Category 3",null,null,null,null,"Antarctica","United States","US Dollar","BRL-AM"]
[7,109098616,"Limited User CAL (Concurrent User)","BRL-AM",null,null,null,{"$f":"IF(AND(C12<>\"\",PRODUCTINFOTABLE[[#This Row],[US Base Price]]<>\"\"),\"SKU\",\"HEADING\")","v":"SKU"},600,1,null,null,null,null,null,null,null,null,null,null,null,null,null,null,null,null,null,null,null,null,null,null,null,null,null,null,{"$f":"IF(PRODUCTINFOTABLE[[#This Row],[Eurozone]]<>\"\",ROUND(PRODUCTINFOTABLE[[#This Row],[Eurozone]]*DKKEURORATE,4),\"\")","v":""},{"$f":"IF(PRODUCTINFOTABLE[[#This Row],[Eurozone]]<>\"\",ROUND(PRODUCTINFOTABLE[[#This Row],[Eurozone]]*NOKEURORATE,4),\"\")","v":""},{"$f":"IF(PRODUCTINFOTABLE[[#This Row],[Eurozone]]<>\"\",ROUND(PRODUCTINFOTABLE[[#This Row],[Eurozone]]*SEKEURORATE,4),\"\")","v":""},{"$f":"IF(PRODUCTINFOTABLE[[#This Row],[Eurozone]]<>\"\",ROUND(PRODUCTINFOTABLE[[#This Row],[Eurozone]]*CHFEURORATE,4),\"\")","v":""},{"$f":"IF(PRODUCTINFOTABLE[[#This Row],[Eurozone]]<>\"\",ROUND(PRODUCTINFOTABLE[[#This Row],[Eurozone]]*GBPEURORATE,4),\"\")","v":""},null,null,null,null,null,"Global Volume Agreement Tier G",9,0.45,null,"Arabic (Kuwait)-4942 - Category 3",null,null,null,null,"Antigua and Barbuda","United States","US Dollar","BRL-AM"]
[8,null,"Configuration and Development",null,null,null,null,{"$f":"IF(AND(C13<>\"\",PRODUCTINFOTABLE[[#This Row],[US Base Price]]<>\"\"),\"SKU\",\"HEADING\")","v":"HEADING"},null,null,null,null,null,null,null,null,null,null,null,null,null,null,null,null,null,null,null,null,null,null,null,null,null,null,null,null,null,null,null,null,null,null,null,null,null,null,"Global Volume Agreement Tier H",10,0.5,null,"Arabic (Lebanon)-4943 - Category 3",null,null,null,null,"Argentina","United States","US Dollar","BRL-AM"]
[9,109099124,"Customization Pack","BRL-AM",null,null,null,{"$f":"IF(AND(C14<>\"\",PRODUCTINFOTABLE[[#This Row],[US Base Price]]<>\"\"),\"SKU\",\"HEADING\")","v":"SKU"},6000,1,null,null,null,null,null,null,null,null,null,null,null,null,null,null,null,null,null,null,null,null,null,null,null,null,null,null,null,null,null,null,null,null,null,null,null,null,"Global Volume Agreement Tier I",11,0.55000000000000004,null,"Arabic (Libya)-4944 - Category 3",null,null,null,null,"Armenia","United States","US Dollar","BRL-AM"]
[10,null,"Business Intelligence and Reporting",null,null,null,null,{"$f":"IF(AND(C15<>\"\",PRODUCTINFOTABLE[[#This Row],[US Base Price]]<>\"\"),\"SKU\",\"HEADING\")","v":"HEADING"},null,null,null,null,null,null,null,null,null,null,null,null,null,null,null,null,null,null,null,null,null,null,null,null,null,null,null,null,null,null,null,null,null,null,null,null,null,null,null,null,null,null,"Arabic (Morocco)-4945 - Category 3",null,null,null,null,"Aruba","United States","US Dollar","BRL-AM"]
[11,109100028,"SmartList Builder Pack","BRL-AM",null,null,null,{"$f":"IF(AND(C16<>\"\",PRODUCTINFOTABLE[[#This Row],[US Base Price]]<>\"\"),\"SKU\",\"HEADING\")","v":"SKU"},2000,1,null,null,null,null,null,null,null,null,null,null,null,null,null,null,null,null,null,null,null,null,null,null,null,null,null,null,{"$f":"IF(PRODUCTINFOTABLE[[#This Row],[Eurozone]]<>\"\",ROUND(PRODUCTINFOTABLE[[#This Row],[Eurozone]]*DKKEURORATE,4),\"\")","v":""},{"$f":"IF(PRODUCTINFOTABLE[[#This Row],[Eurozone]]<>\"\",ROUND(PRODUCTINFOTABLE[[#This Row],[Eurozone]]*NOKEURORATE,4),\"\")","v":""},{"$f":"IF(PRODUCTINFOTABLE[[#This Row],[Eurozone]]<>\"\",ROUND(PRODUCTINFOTABLE[[#This Row],[Eurozone]]*SEKEURORATE,4),\"\")","v":""},{"$f":"IF(PRODUCTINFOTABLE[[#This Row],[Eurozone]]<>\"\",ROUND(PRODUCTINFOTABLE[[#This Row],[Eurozone]]*CHFEURORATE,4),\"\")","v":""},{"$f":"IF(PRODUCTINFOTABLE[[#This Row],[Eurozone]]<>\"\",ROUND(PRODUCTINFOTABLE[[#This Row],[Eurozone]]*GBPEURORATE,4),\"\")","v":""},null,null,null,null,null,null,null,null,null,"Arabic (Oman)-4946 - Category 3",null,null,null,null,"Australia","United States","Australian Dollar","BRL-AM"]
[12,null,"Human Resource Management",null,null,null,null,{"$f":"IF(AND(C17<>\"\",PRODUCTINFOTABLE[[#This Row],[US Base Price]]<>\"\"),\"SKU\",\"HEADING\")","v":"HEADING"},null,null,null,null,null,null,null,null,null,null,null,null,null,null,null,null,null,null,null,null,null,null,null,null,null,null,null,null,{"$f":"IF(PRODUCTINFOTABLE[[#This Row],[Eurozone]]<>\"\",ROUND(PRODUCTINFOTABLE[[#This Row],[Eurozone]]*DKKEURORATE,4),\"\")","v":""},{"$f":"IF(PRODUCTINFOTABLE[[#This Row],[Eurozone]]<>\"\",ROUND(PRODUCTINFOTABLE[[#This Row],[Eurozone]]*NOKEURORATE,4),\"\")","v":""},{"$f":"IF(PRODUCTINFOTABLE[[#This Row],[Eurozone]]<>\"\",ROUND(PRODUCTINFOTABLE[[#This Row],[Eurozone]]*SEKEURORATE,4),\"\")","v":""},{"$f":"IF(PRODUCTINFOTABLE[[#This Row],[Eurozone]]<>\"\",ROUND(PRODUCTINFOTABLE[[#This Row],[Eurozone]]*CHFEURORATE,4),\"\")","v":""},{"$f":"IF(PRODUCTINFOTABLE[[#This Row],[Eurozone]]<>\"\",ROUND(PRODUCTINFOTABLE[[#This Row],[Eurozone]]*GBPEURORATE,4),\"\")","v":""},null,null,null,null,null,null,null,null,null,"Arabic (Qatar)-4947 - Category 3",null,null,null,null,"Austria","Austria","Euro","BRL-AM"]
[13,109100029,"Extended Human Resources and Payroll ","BRL-AM",null,null,null,{"$f":"IF(AND(C18<>\"\",PRODUCTINFOTABLE[[#This Row],[US Base Price]]<>\"\"),\"SKU\",\"HEADING\")","v":"SKU"},7000,1,null,null,null,null,null,null,null,null,null,null,null,null,null,null,null,null,null,null,null,null,null,null,null,null,null,null,{"$f":"IF(PRODUCTINFOTABLE[[#This Row],[Eurozone]]<>\"\",ROUND(PRODUCTINFOTABLE[[#This Row],[Eurozone]]*DKKEURORATE,4),\"\")","v":""},{"$f":"IF(PRODUCTINFOTABLE[[#This Row],[Eurozone]]<>\"\",ROUND(PRODUCTINFOTABLE[[#This Row],[Eurozone]]*NOKEURORATE,4),\"\")","v":""},{"$f":"IF(PRODUCTINFOTABLE[[#This Row],[Eurozone]]<>\"\",ROUND(PRODUCTINFOTABLE[[#This Row],[Eurozone]]*SEKEURORATE,4),\"\")","v":""},{"$f":"IF(PRODUCTINFOTABLE[[#This Row],[Eurozone]]<>\"\",ROUND(PRODUCTINFOTABLE[[#This Row],[Eurozone]]*CHFEURORATE,4),\"\")","v":""},{"$f":"IF(PRODUCTINFOTABLE[[#This Row],[Eurozone]]<>\"\",ROUND(PRODUCTINFOTABLE[[#This Row],[Eurozone]]*GBPEURORATE,4),\"\")","v":""},null,null,null,null,null,null,null,null,null,"Arabic (Saudi Arabia)-4948 - Category 3",null,null,null,null,"Azerbaijan","United States","US Dollar","BRL-AM"]
[14,null,"Financial Management",null,null,null,null,{"$f":"IF(AND(C19<>\"\",PRODUCTINFOTABLE[[#This Row],[US Base Price]]<>\"\"),\"SKU\",\"HEADING\")","v":"HEADING"},null,null,null,null,null,null,null,null,null,null,null,null,null,null,null,null,null,null,null,null,null,null,null,null,null,null,null,null,{"$f":"IF(PRODUCTINFOTABLE[[#This Row],[Eurozone]]<>\"\",ROUND(PRODUCTINFOTABLE[[#This Row],[Eurozone]]*DKKEURORATE,4),\"\")","v":""},{"$f":"IF(PRODUCTINFOTABLE[[#This Row],[Eurozone]]<>\"\",ROUND(PRODUCTINFOTABLE[[#This Row],[Eurozone]]*NOKEURORATE,4),\"\")","v":""},{"$f":"IF(PRODUCTINFOTABLE[[#This Row],[Eurozone]]<>\"\",ROUND(PRODUCTINFOTABLE[[#This Row],[Eurozone]]*SEKEURORATE,4),\"\")","v":""},{"$f":"IF(PRODUCTINFOTABLE[[#This Row],[Eurozone]]<>\"\",ROUND(PRODUCTINFOTABLE[[#This Row],[Eurozone]]*CHFEURORATE,4),\"\")","v":""},{"$f":"IF(PRODUCTINFOTABLE[[#This Row],[Eurozone]]<>\"\",ROUND(PRODUCTINFOTABLE[[#This Row],[Eurozone]]*GBPEURORATE,4),\"\")","v":""},null,null,null,null,null,null,null,null,null,"Arabic (Syria)-4949 - Category 3",null,null,null,null,"Bahamas, The","United States","US Dollar","BRL-AM"]
[15,109100859,"Collections Management","BRL-AM",null,null,null,{"$f":"IF(AND(C20<>\"\",PRODUCTINFOTABLE[[#This Row],[US Base Price]]<>\"\"),\"SKU\",\"HEADING\")","v":"SKU"},3500,1,null,null,null,null,null,null,null,null,null,null,null,null,null,null,null,null,null,null,null,null,null,null,null,null,null,null,{"$f":"IF(PRODUCTINFOTABLE[[#This Row],[Eurozone]]<>\"\",ROUND(PRODUCTINFOTABLE[[#This Row],[Eurozone]]*DKKEURORATE,4),\"\")","v":""},{"$f":"IF(PRODUCTINFOTABLE[[#This Row],[Eurozone]]<>\"\",ROUND(PRODUCTINFOTABLE[[#This Row],[Eurozone]]*NOKEURORATE,4),\"\")","v":""},{"$f":"IF(PRODUCTINFOTABLE[[#This Row],[Eurozone]]<>\"\",ROUND(PRODUCTINFOTABLE[[#This Row],[Eurozone]]*SEKEURORATE,4),\"\")","v":""},{"$f":"IF(PRODUCTINFOTABLE[[#This Row],[Eurozone]]<>\"\",ROUND(PRODUCTINFOTABLE[[#This Row],[Eurozone]]*CHFEURORATE,4),\"\")","v":""},{"$f":"IF(PRODUCTINFOTABLE[[#This Row],[Eurozone]]<>\"\",ROUND(PRODUCTINFOTABLE[[#This Row],[Eurozone]]*GBPEURORATE,4),\"\")","v":""},null,null,null,null,null,null,null,null,null,"Arabic (Tunisia)-4950 - Category 3",null,null,null,null,"Bahrain","United States","US Dollar","BRL-AM"]
[16,null,"Database",null,null,null,null,{"$f":"IF(AND(C21<>\"\",PRODUCTINFOTABLE[[#This Row],[US Base Price]]<>\"\"),\"SKU\",\"HEADING\")","v":"HEADING"},null,null,null,null,null,null,null,null,null,null,null,null,null,null,null,null,null,null,null,null,null,null,null,null,null,null,null,null,{"$f":"IF(PRODUCTINFOTABLE[[#This Row],[Eurozone]]<>\"\",ROUND(PRODUCTINFOTABLE[[#This Row],[Eurozone]]*DKKEURORATE,4),\"\")","v":""},{"$f":"IF(PRODUCTINFOTABLE[[#This Row],[Eurozone]]<>\"\",ROUND(PRODUCTINFOTABLE[[#This Row],[Eurozone]]*NOKEURORATE,4),\"\")","v":""},{"$f":"IF(PRODUCTINFOTABLE[[#This Row],[Eurozone]]<>\"\",ROUND(PRODUCTINFOTABLE[[#This Row],[Eurozone]]*SEKEURORATE,4),\"\")","v":""},{"$f":"IF(PRODUCTINFOTABLE[[#This Row],[Eurozone]]<>\"\",ROUND(PRODUCTINFOTABLE[[#This Row],[Eurozone]]*CHFEURORATE,4),\"\")","v":""},{"$f":"IF(PRODUCTINFOTABLE[[#This Row],[Eurozone]]<>\"\",ROUND(PRODUCTINFOTABLE[[#This Row],[Eurozone]]*GBPEURORATE,4),\"\")","v":""},null,null,null,null,null,null,null,null,null,"Arabic (U.A.E.)-4951 - Category 3",null,null,null,null,"Bangladesh","United States","US Dollar","BRL-AM"]
[17,109100717,"Microsoft® SQL Server® 2008 R2  Standard Edition Runtime CAL (English)","BRL-AM",null,null,"Microsoft® SQL Server® 2008 R2  Standard Edition Runtime Server License - See note C24",{"$f":"IF(AND(C22<>\"\",PRODUCTINFOTABLE[[#This Row],[US Base Price]]<>\"\"),\"SKU\",\"HEADING\")","v":"SKU"},110,1,1,1,1.4490000000000001,1.3360000000000001,1,1,1,8.3000000000000007,1,1,1,52.25,119,1,1,1,1,1.724,1,33,1,1,1,1,1,1.0706,{"$f":"IF(PRODUCTINFOTABLE[[#This Row],[Eurozone]]<>\"\",ROUND(PRODUCTINFOTABLE[[#This Row],[Eurozone]]*DKKEURORATE,4),\"\")","v":7.9701000000000004},{"$f":"IF(PRODUCTINFOTABLE[[#This Row],[Eurozone]]<>\"\",ROUND(PRODUCTINFOTABLE[[#This Row],[Eurozone]]*NOKEURORATE,4),\"\")","v":8.2805999999999997},{"$f":"IF(PRODUCTINFOTABLE[[#This Row],[Eurozone]]<>\"\",ROUND(PRODUCTINFOTABLE[[#This Row],[Eurozone]]*SEKEURORATE,4),\"\")","v":9.7933000000000003},{"$f":"IF(PRODUCTINFOTABLE[[#This Row],[Eurozone]]<>\"\",ROUND(PRODUCTINFOTABLE[[#This Row],[Eurozone]]*CHFEURORATE,4),\"\")","v":1.292},{"$f":"IF(PRODUCTINFOTABLE[[#This Row],[Eurozone]]<>\"\",ROUND(PRODUCTINFOTABLE[[#This Row],[Eurozone]]*GBPEURORATE,4),\"\")","v":0.8448},null,null,null,null,null,null,null,null,null,"Arabic (Yemen)-4952 - Category 3",null,null,null,null,"Barbados","United States","US Dollar","BRL-AM"]
[18,109100709,"Microsoft® SQL Server® 2008 R2  Enterprise Edition Runtime CAL  (English)","BRL-AM",null,null,"Microsoft® SQL Server® 2008 R2  Enterprise Edition Runtime Server License - See note C24",{"$f":"IF(AND(C23<>\"\",PRODUCTINFOTABLE[[#This Row],[US Base Price]]<>\"\"),\"SKU\",\"HEADING\")","v":"SKU"},200,1,1,1,1.4490000000000001,1.3360000000000001,1,1,1,8.3000000000000007,1,1,1,52.25,119,1,1,1,1,1.724,1,33,1,1,1,1,1,1.0706,{"$f":"IF(PRODUCTINFOTABLE[[#This Row],[Eurozone]]<>\"\",ROUND(PRODUCTINFOTABLE[[#This Row],[Eurozone]]*DKKEURORATE,4),\"\")","v":7.9701000000000004},{"$f":"IF(PRODUCTINFOTABLE[[#This Row],[Eurozone]]<>\"\",ROUND(PRODUCTINFOTABLE[[#This Row],[Eurozone]]*NOKEURORATE,4),\"\")","v":8.2805999999999997},{"$f":"IF(PRODUCTINFOTABLE[[#This Row],[Eurozone]]<>\"\",ROUND(PRODUCTINFOTABLE[[#This Row],[Eurozone]]*SEKEURORATE,4),\"\")","v":9.7933000000000003},{"$f":"IF(PRODUCTINFOTABLE[[#This Row],[Eurozone]]<>\"\",ROUND(PRODUCTINFOTABLE[[#This Row],[Eurozone]]*CHFEURORATE,4),\"\")","v":1.292},{"$f":"IF(PRODUCTINFOTABLE[[#This Row],[Eurozone]]<>\"\",ROUND(PRODUCTINFOTABLE[[#This Row],[Eurozone]]*GBPEURORATE,4),\"\")","v":0.8448},null,null,null,null,null,null,null,null,null,"Armenian-4809 - Category 3",null,null,null,null,"Belarus","United States","US Dollar","BRL-AM"]
[19,109100703,"Microsoft® SQL Server® 2008 R2  Enterprise Edition Runtime Server License (English)","BRL-AM",null,null,null,{"$f":"IF(AND(C24<>\"\",PRODUCTINFOTABLE[[#This Row],[US Base Price]]<>\"\"),\"SKU\",\"HEADING\")","v":"SKU"},51,1,1,1,1.4490000000000001,1.3360000000000001,1,1,1,8.3000000000000007,1,1,1,52.25,119,1,1,1,1,1.724,1,33,1,1,1,1,1,1.0706,{"$f":"IF(PRODUCTINFOTABLE[[#This Row],[Eurozone]]<>\"\",ROUND(PRODUCTINFOTABLE[[#This Row],[Eurozone]]*DKKEURORATE,4),\"\")","v":7.9701000000000004},{"$f":"IF(PRODUCTINFOTABLE[[#This Row],[Eurozone]]<>\"\",ROUND(PRODUCTINFOTABLE[[#This Row],[Eurozone]]*NOKEURORATE,4),\"\")","v":8.2805999999999997},{"$f":"IF(PRODUCTINFOTABLE[[#This Row],[Eurozone]]<>\"\",ROUND(PRODUCTINFOTABLE[[#This Row],[Eurozone]]*SEKEURORATE,4),\"\")","v":9.7933000000000003},{"$f":"IF(PRODUCTINFOTABLE[[#This Row],[Eurozone]]<>\"\",ROUND(PRODUCTINFOTABLE[[#This Row],[Eurozone]]*CHFEURORATE,4),\"\")","v":1.292},{"$f":"IF(PRODUCTINFOTABLE[[#This Row],[Eurozone]]<>\"\",ROUND(PRODUCTINFOTABLE[[#This Row],[Eurozone]]*GBPEURORATE,4),\"\")","v":0.8448},null,null,null,null,null,null,null,null,null,"Azeri (Cyrillic)-4802 - Category 3",null,null,null,null,"Belgium","Austria","Euro","BRL-AM"]
[20,109100716,"Microsoft® SQL Server® 2008 R2  Standard Edition Runtime Server License  (English)","BRL-AM",null,null,null,{"$f":"IF(AND(C25<>\"\",PRODUCTINFOTABLE[[#This Row],[US Base Price]]<>\"\"),\"SKU\",\"HEADING\")","v":"SKU"},6,1,1,1,1.4490000000000001,1.3360000000000001,1,1,1,8.3000000000000007,1,1,1,52.25,119,1,1,1,1,1.724,1,33,1,1,1,1,1,1.0706,{"$f":"IF(PRODUCTINFOTABLE[[#This Row],[Eurozone]]<>\"\",ROUND(PRODUCTINFOTABLE[[#This Row],[Eurozone]]*DKKEURORATE,4),\"\")","v":7.9701000000000004},{"$f":"IF(PRODUCTINFOTABLE[[#This Row],[Eurozone]]<>\"\",ROUND(PRODUCTINFOTABLE[[#This Row],[Eurozone]]*NOKEURORATE,4),\"\")","v":8.2805999999999997},{"$f":"IF(PRODUCTINFOTABLE[[#This Row],[Eurozone]]<>\"\",ROUND(PRODUCTINFOTABLE[[#This Row],[Eurozone]]*SEKEURORATE,4),\"\")","v":9.7933000000000003},{"$f":"IF(PRODUCTINFOTABLE[[#This Row],[Eurozone]]<>\"\",ROUND(PRODUCTINFOTABLE[[#This Row],[Eurozone]]*CHFEURORATE,4),\"\")","v":1.292},{"$f":"IF(PRODUCTINFOTABLE[[#This Row],[Eurozone]]<>\"\",ROUND(PRODUCTINFOTABLE[[#This Row],[Eurozone]]*GBPEURORATE,4),\"\")","v":0.8448},null,null,null,null,null,null,null,null,null,"Azeri (Latin)-4801 - Category 3",null,null,null,null,"Belize","United States","US Dollar","BRL-AM"]
[21,null,"Service Plans",null,null,null,null,{"$f":"IF(AND(C26<>\"\",PRODUCTINFOTABLE[[#This Row],[US Base Price]]<>\"\"),\"SKU\",\"HEADING\")","v":"HEADING"},null,null,null,null,null,null,null,null,null,null,null,null,null,null,null,null,null,null,null,null,null,null,null,null,null,null,null,null,{"$f":"IF(PRODUCTINFOTABLE[[#This Row],[Eurozone]]<>\"\",ROUND(PRODUCTINFOTABLE[[#This Row],[Eurozone]]*DKKEURORATE,4),\"\")","v":""},{"$f":"IF(PRODUCTINFOTABLE[[#This Row],[Eurozone]]<>\"\",ROUND(PRODUCTINFOTABLE[[#This Row],[Eurozone]]*NOKEURORATE,4),\"\")","v":""},{"$f":"IF(PRODUCTINFOTABLE[[#This Row],[Eurozone]]<>\"\",ROUND(PRODUCTINFOTABLE[[#This Row],[Eurozone]]*SEKEURORATE,4),\"\")","v":""},{"$f":"IF(PRODUCTINFOTABLE[[#This Row],[Eurozone]]<>\"\",ROUND(PRODUCTINFOTABLE[[#This Row],[Eurozone]]*CHFEURORATE,4),\"\")","v":""},{"$f":"IF(PRODUCTINFOTABLE[[#This Row],[Eurozone]]<>\"\",ROUND(PRODUCTINFOTABLE[[#This Row],[Eurozone]]*GBPEURORATE,4),\"\")","v":""},null,null,null,null,null,null,null,null,null,"Basque-4953 - Category 3",null,null,null,null,"Benin","United States","US Dollar","BRL-AM"]
[22,null,"Enhancement Plan","BRL-AM",null,null,null,{"$f":"IF(AND(C27<>\"\",PRODUCTINFOTABLE[[#This Row],[US Base Price]]<>\"\"),\"SKU\",\"HEADING\")","v":"SKU"},"OVERRIDE",1,0.16,null,0.16,null,0.16,0.16,0.16,0.16,0.16,0.16,0.16,0.16,0.16,null,null,0.16,0.16,0.16,0.16,0.16,0.16,0.16,0.16,0.16,null,0.16,0.16,0.16,0.16,0.16,0.16,null,null,null,null,null,null,null,null,null,"Belarusian-4954 - Category 3",null,null,null,null,"Bermuda","United States","US Dollar","BRL-AM"]
[23,null,"Three Year Business Ready Enhancement Plan","BRL-AM",null,null,null,{"$f":"IF(AND(C28<>\"\",PRODUCTINFOTABLE[[#This Row],[US Base Price]]<>\"\"),\"SKU\",\"HEADING\")","v":"SKU"},"OVERRIDE",1,0.14000000000000001,0.14000000000000001,0.14000000000000001,0.16,0.14000000000000001,0.14000000000000001,0.14000000000000001,0.14000000000000001,0.14000000000000001,0.14000000000000001,0.14000000000000001,0.14000000000000001,0.14000000000000001,0.14000000000000001,0.14000000000000001,0.14000000000000001,0.14000000000000001,0.14000000000000001,0.14000000000000001,0.14000000000000001,0.14000000000000001,0.14000000000000001,0.14000000000000001,0.14000000000000001,0.16,0.14000000000000001,0.14000000000000001,0.14000000000000001,0.14000000000000001,0.14000000000000001,0.14000000000000001,null,null,null,null,null,null,null,null,null,"Bulgarian-4932 - Category 1",null,null,null,null,"Bhutan","United States","US Dollar","BRL-AM"]
[24,null,"Business Ready Enhancement Plus Plan (LATAM)","BRL-AM",null,null,null,{"$f":"IF(AND(C29<>\"\",PRODUCTINFOTABLE[[#This Row],[US Base Price]]<>\"\"),\"SKU\",\"HEADING\")","v":"SKU"},"OVERRIDE",1,null,null,null,null,null,null,0.21,null,0.21,null,null,null,null,null,null,0.21,null,null,0.21,null,null,null,null,null,null,null,null,null,null,null,null,null,null,null,null,null,null,null,null,null,"Catalan-4931 - Category 3",null,null,null,null,"Bolivia","United States","US Dollar","BRL-AM"]
[25,null,"Business Ready Advantage Plan","BRL-AM",null,null,null,{"$f":"IF(AND(C30<>\"\",PRODUCTINFOTABLE[[#This Row],[US Base Price]]<>\"\"),\"SKU\",\"HEADING\")","v":"SKU"},"OVERRIDE",1,null,0.18,null,0.18,null,null,null,null,null,null,null,null,null,0.18,0.18,null,null,null,null,null,null,null,null,null,0.18,null,null,null,null,null,null,null,null,null,null,null,null,null,null,null,"Chinese (Hong Kong)-4827 - Category 3",null,null,null,null,"Bosnia and Herzegovina","United States","US Dollar","BRL-AM"]
[26,null,"Three Year Business Ready Advantage Plan","BRL-AM",null,null,null,{"$f":"IF(AND(C31<>\"\",PRODUCTINFOTABLE[[#This Row],[US Base Price]]<>\"\"),\"SKU\",\"HEADING\")","v":"SKU"},"OVERRIDE",1,null,null,null,0.18,null,null,null,null,null,null,null,null,null,0.18,null,null,null,null,null,null,null,null,null,null,0.18,null,{"$f":"IF(PRODUCTINFOTABLE[[#This Row],[Eurozone]]<>\"\",ROUND(PRODUCTINFOTABLE[[#This Row],[Eurozone]]*DKKEURORATE,4),\"\")","v":""},{"$f":"IF(PRODUCTINFOTABLE[[#This Row],[Eurozone]]<>\"\",ROUND(PRODUCTINFOTABLE[[#This Row],[Eurozone]]*NOKEURORATE,4),\"\")","v":""},{"$f":"IF(PRODUCTINFOTABLE[[#This Row],[Eurozone]]<>\"\",ROUND(PRODUCTINFOTABLE[[#This Row],[Eurozone]]*SEKEURORATE,4),\"\")","v":""},{"$f":"IF(PRODUCTINFOTABLE[[#This Row],[Eurozone]]<>\"\",ROUND(PRODUCTINFOTABLE[[#This Row],[Eurozone]]*CHFEURORATE,4),\"\")","v":""},{"$f":"IF(PRODUCTINFOTABLE[[#This Row],[Eurozone]]<>\"\",ROUND(PRODUCTINFOTABLE[[#This Row],[Eurozone]]*GBPEURORATE,4),\"\")","v":""},null,null,null,null,null,null,null,null,null,"Chinese (Macau)-4829 - Category 3",null,null,null,null,"Botswana","United States","US Dollar","BRL-AM"]
[27,null,"Business Ready Advantage Plus Plan","BRL-AM",null,null,null,{"$f":"IF(AND(C32<>\"\",PRODUCTINFOTABLE[[#This Row],[US Base Price]]<>\"\"),\"SKU\",\"HEADING\")","v":"SKU"},"OVERRIDE",1,null,0.25,null,0.25,null,null,null,null,null,null,null,null,null,0.25,null,null,null,null,null,null,null,null,null,null,0.25,null,{"$f":"IF(PRODUCTINFOTABLE[[#This Row],[Eurozone]]<>\"\",ROUND(PRODUCTINFOTABLE[[#This Row],[Eurozone]]*DKKEURORATE,4),\"\")","v":""},{"$f":"IF(PRODUCTINFOTABLE[[#This Row],[Eurozone]]<>\"\",ROUND(PRODUCTINFOTABLE[[#This Row],[Eurozone]]*NOKEURORATE,4),\"\")","v":""},{"$f":"IF(PRODUCTINFOTABLE[[#This Row],[Eurozone]]<>\"\",ROUND(PRODUCTINFOTABLE[[#This Row],[Eurozone]]*SEKEURORATE,4),\"\")","v":""},{"$f":"IF(PRODUCTINFOTABLE[[#This Row],[Eurozone]]<>\"\",ROUND(PRODUCTINFOTABLE[[#This Row],[Eurozone]]*CHFEURORATE,4),\"\")","v":""},{"$f":"IF(PRODUCTINFOTABLE[[#This Row],[Eurozone]]<>\"\",ROUND(PRODUCTINFOTABLE[[#This Row],[Eurozone]]*GBPEURORATE,4),\"\")","v":""},null,null,null,null,null,null,null,null,null,"Chinese (Singapore)-4828 - Category 3",null,null,null,null,"Bouvet Island","Bouvet Island","Norwegian Krona","BRL-AM"]
[28,null,"Business Ready Advantage Plus Plan (LATAM)","BRL-AM",null,null,null,{"$f":"IF(AND(C33<>\"\",PRODUCTINFOTABLE[[#This Row],[US Base Price]]<>\"\"),\"SKU\",\"HEADING\")","v":"SKU"},"OVERRIDE",1,null,null,null,null,null,null,null,null,null,null,null,null,null,null,null,null,null,null,null,null,null,null,null,null,null,null,{"$f":"IF(PRODUCTINFOTABLE[[#This Row],[Eurozone]]<>\"\",ROUND(PRODUCTINFOTABLE[[#This Row],[Eurozone]]*DKKEURORATE,4),\"\")","v":""},{"$f":"IF(PRODUCTINFOTABLE[[#This Row],[Eurozone]]<>\"\",ROUND(PRODUCTINFOTABLE[[#This Row],[Eurozone]]*NOKEURORATE,4),\"\")","v":""},{"$f":"IF(PRODUCTINFOTABLE[[#This Row],[Eurozone]]<>\"\",ROUND(PRODUCTINFOTABLE[[#This Row],[Eurozone]]*SEKEURORATE,4),\"\")","v":""},{"$f":"IF(PRODUCTINFOTABLE[[#This Row],[Eurozone]]<>\"\",ROUND(PRODUCTINFOTABLE[[#This Row],[Eurozone]]*CHFEURORATE,4),\"\")","v":""},{"$f":"IF(PRODUCTINFOTABLE[[#This Row],[Eurozone]]<>\"\",ROUND(PRODUCTINFOTABLE[[#This Row],[Eurozone]]*GBPEURORATE,4),\"\")","v":""},null,null,null,null,null,null,null,null,null,"CHS Chinese (RPC)-4803 - Category 3",null,null,null,null,"Brazil","United States","US Dollar","BRL-AM"]
[null,null,null,null,null,null,null,null,null,null,null,null,null,null,null,null,null,null,null,null,null,null,null,null,null,null,null,null,null,null,null,null,null,null,null,null,null,null,null,null,null,null,null,null,null,null,null,null,null,null,"CHT Chinese (Taiwan)-4804 - Category 3",null,null,null,null,"British Indian Ocean Territory","United States","US Dollar","BRL-AM"]
[null,null,null,null,null,null,null,null,null,null,null,null,null,null,null,null,null,null,null,null,null,null,null,null,null,null,null,null,null,null,null,null,null,null,null,null,null,null,null,null,null,null,null,null,null,null,null,null,null,null,"Croatian-4955 - Category 1",null,null,null,null,"Brunei","United States","US Dollar","BRL-AM"]
[null,null,null,null,null,null,null,null,null,null,null,null,null,null,null,null,null,null,null,null,null,null,null,null,null,null,null,null,null,null,null,null,null,null,null,null,null,null,null,null,null,null,null,null,null,null,null,null,null,null,"Czech-4901 - Category 1",null,null,null,null,"Bulgaria","Austria","Euro","BRL-AM"]
[null,null,null,null,null,null,null,null,null,null,null,null,null,null,null,null,null,null,null,null,null,null,null,null,null,null,null,null,null,null,null,null,null,null,null,null,null,null,null,null,null,null,null,null,null,null,null,null,null,null,"Danish-4902 - Category 1",null,null,null,null,"Burkina Faso","United States","US Dollar","BRL-AM"]
[null,null,null,null,null,null,null,null,null,null,null,null,null,null,null,null,null,null,null,null,null,null,null,null,null,null,null,null,null,null,null,null,null,null,null,null,null,null,null,null,null,null,null,null,null,null,null,null,null,null,"Dutch (Belgian)-4903 - Category 1",null,null,null,null,"Burundi","United States","US Dollar","BRL-AM"]
[null,null,null,null,null,null,null,null,null,null,null,null,null,null,null,null,null,null,null,null,null,null,null,null,null,null,null,null,null,null,null,null,null,null,null,null,null,null,null,null,null,null,null,null,null,null,null,null,null,null,"Dutch (Standard)-4904 - Category 1",null,null,null,null,"Cambodia","United States","US Dollar","BRL-AM"]
[null,null,null,null,null,null,null,null,null,null,null,null,null,null,null,null,null,null,null,null,null,null,null,null,null,null,null,null,null,null,null,null,null,null,null,null,null,null,null,null,null,null,null,null,null,null,null,null,null,null,"English (Australian)-4905 - Category 1",null,null,null,null,"Cameroon","United States","US Dollar","BRL-AM"]
[null,null,null,null,null,null,null,null,null,null,null,null,null,null,null,null,null,null,null,null,null,null,null,null,null,null,null,null,null,null,null,null,null,null,null,null,null,null,null,null,null,null,null,null,null,null,null,null,null,null,"English (Belize)-4956 - Category 3",null,null,null,null,"Canada","United States","Canadian Dollar","BRL-AM"]
[null,null,null,null,null,null,null,null,null,null,null,null,null,null,null,null,null,null,null,null,null,null,null,null,null,null,null,null,null,null,null,null,null,null,null,null,null,null,null,null,null,null,null,null,null,null,null,null,null,null,"English (Canadian)-4906 - Category 1",null,null,null,null,"Cape Verde","United States","US Dollar","BRL-AM"]
[null,null,null,null,null,null,null,null,null,null,null,null,null,null,null,null,null,null,null,null,null,null,null,null,null,null,null,null,null,null,null,null,null,null,null,null,null,null,null,null,null,null,null,null,null,null,null,null,null,null,"English (Caribbean)-4957 - Category 3",null,null,null,null,"Cayman Islands","United States","US Dollar","BRL-AM"]
[null,null,null,null,null,null,null,null,null,null,null,null,null,null,null,null,null,null,null,null,null,null,null,null,null,null,null,null,null,null,null,null,null,null,null,null,null,null,null,null,null,null,null,null,null,null,null,null,null,null,"English (Ireland)-4958 - Category 1",null,null,null,null,"Central African Republic","United States","US Dollar","BRL-AM"]
[null,null,null,null,null,null,null,null,null,null,null,null,null,null,null,null,null,null,null,null,null,null,null,null,null,null,null,null,null,null,null,null,null,null,null,null,null,null,null,null,null,null,null,null,null,null,null,null,null,null,"English (Jamaica)-4959 - Category 3",null,null,null,null,"Chad","United States","US Dollar","BRL-AM"]
[null,null,null,null,null,null,null,null,null,null,null,null,null,null,null,null,null,null,null,null,null,null,null,null,null,null,null,null,null,null,null,null,null,null,null,null,null,null,null,null,null,null,null,null,null,null,null,null,null,null,"English (New Zealand)-4960 - Category 1",null,null,null,null,"Chile","United States","US Dollar","BRL-AM"]
[null,null,null,null,null,null,null,null,null,null,null,null,null,null,null,null,null,null,null,null,null,null,null,null,null,null,null,null,null,null,null,null,null,null,null,null,null,null,null,null,null,null,null,null,null,null,null,null,null,null,"English (Philippines)-4805 - Category 1",null,null,null,null,"China","United States","Chinese Renminbi","BRL-AM"]
[null,null,null,null,null,null,null,null,null,null,null,null,null,null,null,null,null,null,null,null,null,null,null,null,null,null,null,null,null,null,null,null,null,null,null,null,null,null,null,null,null,null,null,null,null,null,null,null,null,null,"English (South Africa)-4907 - Category 3",null,null,null,null,"Christmas Island","United States","Australian Dollar","BRL-AM"]
[null,null,null,null,null,null,null,null,null,null,null,null,null,null,null,null,null,null,null,null,null,null,null,null,null,null,null,null,null,null,null,null,null,null,null,null,null,null,null,null,null,null,null,null,null,null,null,null,null,null,"English (Trinidad)-4961 - Category 3",null,null,null,null,"Cocos (Keeling) Islands","United States","Australian Dollar","BRL-AM"]
[null,null,null,null,null,null,null,null,null,null,null,null,null,null,null,null,null,null,null,null,null,null,null,null,null,null,null,null,null,null,null,null,null,null,null,null,null,null,null,null,null,null,null,null,null,null,null,null,null,null,"English (United Kingdom)-4908 - Category 1",null,null,null,null,"Colombia","United States","US Dollar","BRL-AM"]
[null,null,null,null,null,null,null,null,null,null,null,null,null,null,null,null,null,null,null,null,null,null,null,null,null,null,null,null,null,null,null,null,null,null,null,null,null,null,null,null,null,null,null,null,null,null,null,null,null,null,"English (United States)-4909 - Category 1",null,null,null,null,"Comoros","United States","US Dollar","BRL-AM"]
[null,null,null,null,null,null,null,null,null,null,null,null,null,null,null,null,null,null,null,null,null,null,null,null,null,null,null,null,null,null,null,null,null,null,null,null,null,null,null,null,null,null,null,null,null,null,null,null,null,null,"English (Zimbabwe)-4806 - Category 3",null,null,null,null,"Congo","United States","US Dollar","BRL-AM"]
[null,null,null,null,null,null,null,null,null,null,null,null,null,null,null,null,null,null,null,null,null,null,null,null,null,null,null,null,null,null,null,null,null,null,null,null,null,null,null,null,null,null,null,null,null,null,null,null,null,null,"Estonian-4910 - Category 1",null,null,null,null,"Congo (DRC)","United States","US Dollar","BRL-AM"]
[null,null,null,null,null,null,null,null,null,null,null,null,null,null,null,null,null,null,null,null,null,null,null,null,null,null,null,null,null,null,null,null,null,null,null,null,null,null,null,null,null,null,null,null,null,null,null,null,null,null,"Faeroese-4962 - Category 3",null,null,null,null,"Cook Islands","United States","New Zealand Dollar","BRL-AM"]
[null,null,null,null,null,null,null,null,null,null,null,null,null,null,null,null,null,null,null,null,null,null,null,null,null,null,null,null,null,null,null,null,null,null,null,null,null,null,null,null,null,null,null,null,null,null,null,null,null,null,"Farsi-4963 - Category 3",null,null,null,null,"Costa Rica","United States","US Dollar","BRL-AM"]
[null,null,null,null,null,null,null,null,null,null,null,null,null,null,null,null,null,null,null,null,null,null,null,null,null,null,null,null,null,null,null,null,null,null,null,null,null,null,null,null,null,null,null,null,null,null,null,null,null,null,"Finnish-4911 - Category 1",null,null,null,null,"Côte d'Ivoire","United States","US Dollar","BRL-AM"]
[null,null,null,null,null,null,null,null,null,null,null,null,null,null,null,null,null,null,null,null,null,null,null,null,null,null,null,null,null,null,null,null,null,null,null,null,null,null,null,null,null,null,null,null,null,null,null,null,null,null,"French (Belgian)-4912 - Category 1",null,null,null,null,"Croatia","Austria","Euro","BRL-AM"]
[null,null,null,null,null,null,null,null,null,null,null,null,null,null,null,null,null,null,null,null,null,null,null,null,null,null,null,null,null,null,null,null,null,null,null,null,null,null,null,null,null,null,null,null,null,null,null,null,null,null,"French (Canadian)-4913 - Category 1",null,null,null,null,"Cuba","United States","US Dollar","BRL-AM"]
[null,null,null,null,null,null,null,null,null,null,null,null,null,null,null,null,null,null,null,null,null,null,null,null,null,null,null,null,null,null,null,null,null,null,null,null,null,null,null,null,null,null,null,null,null,null,null,null,null,null,"French (Luxembourg)-4964 - Category 3",null,null,null,null,"Cyprus","Austria","Euro","BRL-AM"]
[null,null,null,null,null,null,null,null,null,null,null,null,null,null,null,null,null,null,null,null,null,null,null,null,null,null,null,null,null,null,null,null,null,null,null,null,null,null,null,null,null,null,null,null,null,null,null,null,null,null,"French (Monaco)-4807 - Category 3",null,null,null,null,"Czech Republic","Austria","Euro","BRL-AM"]
[null,null,null,null,null,null,null,null,null,null,null,null,null,null,null,null,null,null,null,null,null,null,null,null,null,null,null,null,null,null,null,null,null,null,null,null,null,null,null,null,null,null,null,null,null,null,null,null,null,null,"French (Standard)-4914 - Category 1",null,null,null,null,"Denmark","Denmark","Danish Krone","BRL-AM"]
[null,null,null,null,null,null,null,null,null,null,null,null,null,null,null,null,null,null,null,null,null,null,null,null,null,null,null,null,null,null,null,null,null,null,null,null,null,null,null,null,null,null,null,null,null,null,null,null,null,null,"French (Swiss)-4965 - Category 1",null,null,null,null,"Djibouti","United States","US Dollar","BRL-AM"]
[null,null,null,null,null,null,null,null,null,null,null,null,null,null,null,null,null,null,null,null,null,null,null,null,null,null,null,null,null,null,null,null,null,null,null,null,null,null,null,null,null,null,null,null,null,null,null,null,null,null,"German (Austrian)-4915 - Category 1",null,null,null,null,"Dominica","United States","US Dollar","BRL-AM"]
[null,null,null,null,null,null,null,null,null,null,null,null,null,null,null,null,null,null,null,null,null,null,null,null,null,null,null,null,null,null,null,null,null,null,null,null,null,null,null,null,null,null,null,null,null,null,null,null,null,null,"German (Liechtenstein)-4966 - Category 3",null,null,null,null,"Dominican Republic","United States","US Dollar","BRL-AM"]
[null,null,null,null,null,null,null,null,null,null,null,null,null,null,null,null,null,null,null,null,null,null,null,null,null,null,null,null,null,null,null,null,null,null,null,null,null,null,null,null,null,null,null,null,null,null,null,null,null,null,"German (Luxembourg)-4967 - Category 3",null,null,null,null,"Ecuador","United States","US Dollar","BRL-AM"]
[null,null,null,null,null,null,null,null,null,null,null,null,null,null,null,null,null,null,null,null,null,null,null,null,null,null,null,null,null,null,null,null,null,null,null,null,null,null,null,null,null,null,null,null,null,null,null,null,null,null,"German (Standard)-4916 - Category 1",null,null,null,null,"Egypt","United States","US Dollar","BRL-AM"]
[null,null,null,null,null,null,null,null,null,null,null,null,null,null,null,null,null,null,null,null,null,null,null,null,null,null,null,null,null,null,null,null,null,null,null,null,null,null,null,null,null,null,null,null,null,null,null,null,null,null,"German (Swiss)-4917 - Category 1",null,null,null,null,"El Salvador","United States","US Dollar","BRL-AM"]
[null,null,null,null,null,null,null,null,null,null,null,null,null,null,null,null,null,null,null,null,null,null,null,null,null,null,null,null,null,null,null,null,null,null,null,null,null,null,null,null,null,null,null,null,null,null,null,null,null,null,"Greek-4918 - Category 1",null,null,null,null,"Equatorial Guinea","United States","US Dollar","BRL-AM"]
[null,null,null,null,null,null,null,null,null,null,null,null,null,null,null,null,null,null,null,null,null,null,null,null,null,null,null,null,null,null,null,null,null,null,null,null,null,null,null,null,null,null,null,null,null,null,null,null,null,null,"Hebrew-4919 - Category 3",null,null,null,null,"Eritrea","United States","US Dollar","BRL-AM"]
[null,null,null,null,null,null,null,null,null,null,null,null,null,null,null,null,null,null,null,null,null,null,null,null,null,null,null,null,null,null,null,null,null,null,null,null,null,null,null,null,null,null,null,null,null,null,null,null,null,null,"Hindi-4808 - Category 3",null,null,null,null,"Estonia","Austria","Euro","BRL-AM"]
[null,null,null,null,null,null,null,null,null,null,null,null,null,null,null,null,null,null,null,null,null,null,null,null,null,null,null,null,null,null,null,null,null,null,null,null,null,null,null,null,null,null,null,null,null,null,null,null,null,null,"Hungarian-4930 - Category 1",null,null,null,null,"Ethiopia","United States","US Dollar","BRL-AM"]
[null,null,null,null,null,null,null,null,null,null,null,null,null,null,null,null,null,null,null,null,null,null,null,null,null,null,null,null,null,null,null,null,null,null,null,null,null,null,null,null,null,null,null,null,null,null,null,null,null,null,"Icelandic-4920 - Category 1",null,null,null,null,"Falkland Islands (Islas Malvinas)","United States","US Dollar","BRL-AM"]
[null,null,null,null,null,null,null,null,null,null,null,null,null,null,null,null,null,null,null,null,null,null,null,null,null,null,null,null,null,null,null,null,null,null,null,null,null,null,null,null,null,null,null,null,null,null,null,null,null,null,"Indonesian-4968 - Category 3",null,null,null,null,"Faroe Islands","Faroe Islands","Danish Krone","BRL-AM"]
[null,null,null,null,null,null,null,null,null,null,null,null,null,null,null,null,null,null,null,null,null,null,null,null,null,null,null,null,null,null,null,null,null,null,null,null,null,null,null,null,null,null,null,null,null,null,null,null,null,null,"Italian (Standard)-4921 - Category 1",null,null,null,null,"Fiji Islands","United States","US Dollar","BRL-AM"]
[null,null,null,null,null,null,null,null,null,null,null,null,null,null,null,null,null,null,null,null,null,null,null,null,null,null,null,null,null,null,null,null,null,null,null,null,null,null,null,null,null,null,null,null,null,null,null,null,null,null,"Italian (Swiss)-4933 - Category 1",null,null,null,null,"Finland","Austria","Euro","BRL-AM"]
[null,null,null,null,null,null,null,null,null,null,null,null,null,null,null,null,null,null,null,null,null,null,null,null,null,null,null,null,null,null,null,null,null,null,null,null,null,null,null,null,null,null,null,null,null,null,null,null,null,null,"Japanese-4810 - Category 3",null,null,null,null,"France","Austria","Euro","BRL-AM"]
[null,null,null,null,null,null,null,null,null,null,null,null,null,null,null,null,null,null,null,null,null,null,null,null,null,null,null,null,null,null,null,null,null,null,null,null,null,null,null,null,null,null,null,null,null,null,null,null,null,null,"Kazahk-4812 - Category 3",null,null,null,null,"French Guiana","Austria","Euro","BRL-AM"]
[null,null,null,null,null,null,null,null,null,null,null,null,null,null,null,null,null,null,null,null,null,null,null,null,null,null,null,null,null,null,null,null,null,null,null,null,null,null,null,null,null,null,null,null,null,null,null,null,null,null,"Konkani-4813 - Category 3",null,null,null,null,"French Polynesia","United States","US Dollar","BRL-AM"]
[null,null,null,null,null,null,null,null,null,null,null,null,null,null,null,null,null,null,null,null,null,null,null,null,null,null,null,null,null,null,null,null,null,null,null,null,null,null,null,null,null,null,null,null,null,null,null,null,null,null,"Korean-4814 - Category 3",null,null,null,null,"French Southern and Antarctic Lands","Austria","Euro","BRL-AM"]
[null,null,null,null,null,null,null,null,null,null,null,null,null,null,null,null,null,null,null,null,null,null,null,null,null,null,null,null,null,null,null,null,null,null,null,null,null,null,null,null,null,null,null,null,null,null,null,null,null,null,"Latvian-4922 - Category 1",null,null,null,null,"Gabon","United States","US Dollar","BRL-AM"]
[null,null,null,null,null,null,null,null,null,null,null,null,null,null,null,null,null,null,null,null,null,null,null,null,null,null,null,null,null,null,null,null,null,null,null,null,null,null,null,null,null,null,null,null,null,null,null,null,null,null,"Lithuanian-4923 - Category 1",null,null,null,null,"Gambia, The","United States","US Dollar","BRL-AM"]
[null,null,null,null,null,null,null,null,null,null,null,null,null,null,null,null,null,null,null,null,null,null,null,null,null,null,null,null,null,null,null,null,null,null,null,null,null,null,null,null,null,null,null,null,null,null,null,null,null,null,"Macedonian (FYROM)-4816 - Category 3",null,null,null,null,"Georgia","United States","US Dollar","BRL-AM"]
[null,null,null,null,null,null,null,null,null,null,null,null,null,null,null,null,null,null,null,null,null,null,null,null,null,null,null,null,null,null,null,null,null,null,null,null,null,null,null,null,null,null,null,null,null,null,null,null,null,null,"Malay (Brunei Darussalam)-4817 - Category 3",null,null,null,null,"Germany","Austria","Euro","BRL-AM"]
[null,null,null,null,null,null,null,null,null,null,null,null,null,null,null,null,null,null,null,null,null,null,null,null,null,null,null,null,null,null,null,null,null,null,null,null,null,null,null,null,null,null,null,null,null,null,null,null,null,null,"Malay (Malaysia)-4818 - Category 3",null,null,null,null,"Ghana","United States","US Dollar","BRL-AM"]
[null,null,null,null,null,null,null,null,null,null,null,null,null,null,null,null,null,null,null,null,null,null,null,null,null,null,null,null,null,null,null,null,null,null,null,null,null,null,null,null,null,null,null,null,null,null,null,null,null,null,"Marathi-4815 - Category 3",null,null,null,null,"Gibraltar","Gibraltar","Pounds Sterling","BRL-AM"]
[null,null,null,null,null,null,null,null,null,null,null,null,null,null,null,null,null,null,null,null,null,null,null,null,null,null,null,null,null,null,null,null,null,null,null,null,null,null,null,null,null,null,null,null,null,null,null,null,null,null,"Multiple System Languages-4900 - Category 3",null,null,null,null,"Greece","Austria","Euro","BRL-AM"]
[null,null,null,null,null,null,null,null,null,null,null,null,null,null,null,null,null,null,null,null,null,null,null,null,null,null,null,null,null,null,null,null,null,null,null,null,null,null,null,null,null,null,null,null,null,null,null,null,null,null,"Norwegian (Bokmal)-4924 - Category 1",null,null,null,null,"Greenland","Greenland","Danish Krone","BRL-AM"]
[null,null,null,null,null,null,null,null,null,null,null,null,null,null,null,null,null,null,null,null,null,null,null,null,null,null,null,null,null,null,null,null,null,null,null,null,null,null,null,null,null,null,null,null,null,null,null,null,null,null,"Norwegian (Nynorsk)-4925 - Category 3",null,null,null,null,"Grenada","United States","US Dollar","BRL-AM"]
[null,null,null,null,null,null,null,null,null,null,null,null,null,null,null,null,null,null,null,null,null,null,null,null,null,null,null,null,null,null,null,null,null,null,null,null,null,null,null,null,null,null,null,null,null,null,null,null,null,null,"Polish-4929 - Category 1",null,null,null,null,"Guadeloupe","Austria","Euro","BRL-AM"]
[null,null,null,null,null,null,null,null,null,null,null,null,null,null,null,null,null,null,null,null,null,null,null,null,null,null,null,null,null,null,null,null,null,null,null,null,null,null,null,null,null,null,null,null,null,null,null,null,null,null,"Portuguese (Brazilian)-4969 - Category 3",null,null,null,null,"Guam","United States","US Dollar","BRL-AM"]
[null,null,null,null,null,null,null,null,null,null,null,null,null,null,null,null,null,null,null,null,null,null,null,null,null,null,null,null,null,null,null,null,null,null,null,null,null,null,null,null,null,null,null,null,null,null,null,null,null,null,"Portuguese (Standard)-4970 - Category 1",null,null,null,null,"Guatemala","United States","US Dollar","BRL-AM"]
[null,null,null,null,null,null,null,null,null,null,null,null,null,null,null,null,null,null,null,null,null,null,null,null,null,null,null,null,null,null,null,null,null,null,null,null,null,null,null,null,null,null,null,null,null,null,null,null,null,null,"Romanian-4971 - Category 1",null,null,null,null,"Guinea","United States","US Dollar","BRL-AM"]
[null,null,null,null,null,null,null,null,null,null,null,null,null,null,null,null,null,null,null,null,null,null,null,null,null,null,null,null,null,null,null,null,null,null,null,null,null,null,null,null,null,null,null,null,null,null,null,null,null,null,"Russian-4926 - Category 1",null,null,null,null,"Guinea-Bissau","United States","US Dollar","BRL-AM"]
[null,null,null,null,null,null,null,null,null,null,null,null,null,null,null,null,null,null,null,null,null,null,null,null,null,null,null,null,null,null,null,null,null,null,null,null,null,null,null,null,null,null,null,null,null,null,null,null,null,null,"Sanskrit-4819 - Category 3",null,null,null,null,"Guyana","United States","US Dollar","BRL-AM"]
[null,null,null,null,null,null,null,null,null,null,null,null,null,null,null,null,null,null,null,null,null,null,null,null,null,null,null,null,null,null,null,null,null,null,null,null,null,null,null,null,null,null,null,null,null,null,null,null,null,null,"Serbian (Cyrillic)-4972 - Category 3",null,null,null,null,"Haiti","United States","US Dollar","BRL-AM"]
[null,null,null,null,null,null,null,null,null,null,null,null,null,null,null,null,null,null,null,null,null,null,null,null,null,null,null,null,null,null,null,null,null,null,null,null,null,null,null,null,null,null,null,null,null,null,null,null,null,null,"Serbian (Latin)-4973 - Category 1",null,null,null,null,"Heard Island and McDonald Islands","United States","Australian Dollar","BRL-AM"]
[null,null,null,null,null,null,null,null,null,null,null,null,null,null,null,null,null,null,null,null,null,null,null,null,null,null,null,null,null,null,null,null,null,null,null,null,null,null,null,null,null,null,null,null,null,null,null,null,null,null,"Slovak-4974 - Category 1",null,null,null,null,"Honduras","United States","US Dollar","BRL-AM"]
[null,null,null,null,null,null,null,null,null,null,null,null,null,null,null,null,null,null,null,null,null,null,null,null,null,null,null,null,null,null,null,null,null,null,null,null,null,null,null,null,null,null,null,null,null,null,null,null,null,null,"Slovenian-4975 - Category 1",null,null,null,null,"Hong Kong SAR","United States","US Dollar","BRL-AM"]
[null,null,null,null,null,null,null,null,null,null,null,null,null,null,null,null,null,null,null,null,null,null,null,null,null,null,null,null,null,null,null,null,null,null,null,null,null,null,null,null,null,null,null,null,null,null,null,null,null,null,"Spanish (Argentina)-4976 - Category 3",null,null,null,null,"Hungary","Austria","Euro","BRL-AM"]
[null,null,null,null,null,null,null,null,null,null,null,null,null,null,null,null,null,null,null,null,null,null,null,null,null,null,null,null,null,null,null,null,null,null,null,null,null,null,null,null,null,null,null,null,null,null,null,null,null,null,"Spanish (Bolivia)-4977 - Category 3",null,null,null,null,"Iceland","Austria","Euro","BRL-AM"]
[null,null,null,null,null,null,null,null,null,null,null,null,null,null,null,null,null,null,null,null,null,null,null,null,null,null,null,null,null,null,null,null,null,null,null,null,null,null,null,null,null,null,null,null,null,null,null,null,null,null,"Spanish (Chile)-4978 - Category 3",null,null,null,null,"India","United States","Indian Rupee","BRL-AM"]
[null,null,null,null,null,null,null,null,null,null,null,null,null,null,null,null,null,null,null,null,null,null,null,null,null,null,null,null,null,null,null,null,null,null,null,null,null,null,null,null,null,null,null,null,null,null,null,null,null,null,"Spanish (Colombia)-4979 - Category 3",null,null,null,null,"Indonesia","United States","US Dollar","BRL-AM"]
[null,null,null,null,null,null,null,null,null,null,null,null,null,null,null,null,null,null,null,null,null,null,null,null,null,null,null,null,null,null,null,null,null,null,null,null,null,null,null,null,null,null,null,null,null,null,null,null,null,null,"Spanish (Costa Rica)-4980 - Category 3",null,null,null,null,"Iran","United States","US Dollar","BRL-AM"]
[null,null,null,null,null,null,null,null,null,null,null,null,null,null,null,null,null,null,null,null,null,null,null,null,null,null,null,null,null,null,null,null,null,null,null,null,null,null,null,null,null,null,null,null,null,null,null,null,null,null,"Spanish (Dominican Rep.)-4981 - Category 3",null,null,null,null,"Iraq","United States","US Dollar","BRL-AM"]
[null,null,null,null,null,null,null,null,null,null,null,null,null,null,null,null,null,null,null,null,null,null,null,null,null,null,null,null,null,null,null,null,null,null,null,null,null,null,null,null,null,null,null,null,null,null,null,null,null,null,"Spanish (Ecuador)-4982 - Category 3",null,null,null,null,"Ireland, Republic of","Austria","Euro","BRL-AM"]
[null,null,null,null,null,null,null,null,null,null,null,null,null,null,null,null,null,null,null,null,null,null,null,null,null,null,null,null,null,null,null,null,null,null,null,null,null,null,null,null,null,null,null,null,null,null,null,null,null,null,"Spanish (El Salvador)-4983 - Category 3",null,null,null,null,"Israel","United States","US Dollar","BRL-AM"]
[null,null,null,null,null,null,null,null,null,null,null,null,null,null,null,null,null,null,null,null,null,null,null,null,null,null,null,null,null,null,null,null,null,null,null,null,null,null,null,null,null,null,null,null,null,null,null,null,null,null,"Spanish (Guatemala)-4984 - Category 3",null,null,null,null,"Italy","Austria","Euro","BRL-AM"]
[null,null,null,null,null,null,null,null,null,null,null,null,null,null,null,null,null,null,null,null,null,null,null,null,null,null,null,null,null,null,null,null,null,null,null,null,null,null,null,null,null,null,null,null,null,null,null,null,null,null,"Spanish (Honduras)-4985 - Category 3",null,null,null,null,"Jamaica","United States","US Dollar","BRL-AM"]
[null,null,null,null,null,null,null,null,null,null,null,null,null,null,null,null,null,null,null,null,null,null,null,null,null,null,null,null,null,null,null,null,null,null,null,null,null,null,null,null,null,null,null,null,null,null,null,null,null,null,"Spanish (Mexican)-4986 - Category 1",null,null,null,null,"Japan","United States","Japanese Yen","BRL-AM"]
[null,null,null,null,null,null,null,null,null,null,null,null,null,null,null,null,null,null,null,null,null,null,null,null,null,null,null,null,null,null,null,null,null,null,null,null,null,null,null,null,null,null,null,null,null,null,null,null,null,null,"Spanish (Modern Sort)-4987 - Category 3",null,null,null,null,"Jordan","United States","US Dollar","BRL-AM"]
[null,null,null,null,null,null,null,null,null,null,null,null,null,null,null,null,null,null,null,null,null,null,null,null,null,null,null,null,null,null,null,null,null,null,null,null,null,null,null,null,null,null,null,null,null,null,null,null,null,null,"Spanish (Nicaragua)-4988 - Category 3",null,null,null,null,"Kazakhstan","United States","US Dollar","BRL-AM"]
[null,null,null,null,null,null,null,null,null,null,null,null,null,null,null,null,null,null,null,null,null,null,null,null,null,null,null,null,null,null,null,null,null,null,null,null,null,null,null,null,null,null,null,null,null,null,null,null,null,null,"Spanish (Panama)-4989 - Category 3",null,null,null,null,"Kenya","United States","US Dollar","BRL-AM"]
[null,null,null,null,null,null,null,null,null,null,null,null,null,null,null,null,null,null,null,null,null,null,null,null,null,null,null,null,null,null,null,null,null,null,null,null,null,null,null,null,null,null,null,null,null,null,null,null,null,null,"Spanish (Paraguay)-4990 - Category 3",null,null,null,null,"Kiribati","United States","Australian Dollar","BRL-AM"]
[null,null,null,null,null,null,null,null,null,null,null,null,null,null,null,null,null,null,null,null,null,null,null,null,null,null,null,null,null,null,null,null,null,null,null,null,null,null,null,null,null,null,null,null,null,null,null,null,null,null,"Spanish (Peru)-4991 - Category 3",null,null,null,null,"Korea, North","United States","US Dollar","BRL-AM"]
[null,null,null,null,null,null,null,null,null,null,null,null,null,null,null,null,null,null,null,null,null,null,null,null,null,null,null,null,null,null,null,null,null,null,null,null,null,null,null,null,null,null,null,null,null,null,null,null,null,null,"Spanish (Puerto Rico)-4992 - Category 3",null,null,null,null,"Korea, South","United States","US Dollar","BRL-AM"]
[null,null,null,null,null,null,null,null,null,null,null,null,null,null,null,null,null,null,null,null,null,null,null,null,null,null,null,null,null,null,null,null,null,null,null,null,null,null,null,null,null,null,null,null,null,null,null,null,null,null,"Spanish (Uruguay)-4993 - Category 3",null,null,null,null,"Kuwait","United States","US Dollar","BRL-AM"]
[null,null,null,null,null,null,null,null,null,null,null,null,null,null,null,null,null,null,null,null,null,null,null,null,null,null,null,null,null,null,null,null,null,null,null,null,null,null,null,null,null,null,null,null,null,null,null,null,null,null,"Spanish (Venezuela)-4994 - Category 3",null,null,null,null,"Kyrgyzstan","United States","US Dollar","BRL-AM"]
[null,null,null,null,null,null,null,null,null,null,null,null,null,null,null,null,null,null,null,null,null,null,null,null,null,null,null,null,null,null,null,null,null,null,null,null,null,null,null,null,null,null,null,null,null,null,null,null,null,null,"Spanish(Traditional Sort)-4927 - Category 1",null,null,null,null,"Laos","United States","US Dollar","BRL-AM"]
[null,null,null,null,null,null,null,null,null,null,null,null,null,null,null,null,null,null,null,null,null,null,null,null,null,null,null,null,null,null,null,null,null,null,null,null,null,null,null,null,null,null,null,null,null,null,null,null,null,null,"Swahili-4820 - Category 3",null,null,null,null,"Latvia","Austria","Euro","BRL-AM"]
[null,null,null,null,null,null,null,null,null,null,null,null,null,null,null,null,null,null,null,null,null,null,null,null,null,null,null,null,null,null,null,null,null,null,null,null,null,null,null,null,null,null,null,null,null,null,null,null,null,null,"Swedish (Finland)-4995 - Category 3",null,null,null,null,"Lebanon","United States","US Dollar","BRL-AM"]
[null,null,null,null,null,null,null,null,null,null,null,null,null,null,null,null,null,null,null,null,null,null,null,null,null,null,null,null,null,null,null,null,null,null,null,null,null,null,null,null,null,null,null,null,null,null,null,null,null,null,"Swedish-4928 - Category 1 (for customer location Finland the price will default to €0 on order)",null,null,null,null,"Lesotho","United States","US Dollar","BRL-AM"]
[null,null,null,null,null,null,null,null,null,null,null,null,null,null,null,null,null,null,null,null,null,null,null,null,null,null,null,null,null,null,null,null,null,null,null,null,null,null,null,null,null,null,null,null,null,null,null,null,null,null,"Tamil-4821 - Category 3",null,null,null,null,"Liberia","United States","US Dollar","BRL-AM"]
[null,null,null,null,null,null,null,null,null,null,null,null,null,null,null,null,null,null,null,null,null,null,null,null,null,null,null,null,null,null,null,null,null,null,null,null,null,null,null,null,null,null,null,null,null,null,null,null,null,null,"Tatar-4823 - Category 3",null,null,null,null,"Libya","United States","US Dollar","BRL-AM"]
[null,null,null,null,null,null,null,null,null,null,null,null,null,null,null,null,null,null,null,null,null,null,null,null,null,null,null,null,null,null,null,null,null,null,null,null,null,null,null,null,null,null,null,null,null,null,null,null,null,null,"Thai-4822 - Category 1",null,null,null,null,"Liechtenstein","Liechtenstein","Swiss Franc","BRL-AM"]
[null,null,null,null,null,null,null,null,null,null,null,null,null,null,null,null,null,null,null,null,null,null,null,null,null,null,null,null,null,null,null,null,null,null,null,null,null,null,null,null,null,null,null,null,null,null,null,null,null,null,"Turkish-4934 - Category 1",null,null,null,null,"Lithuania","Austria","Euro","BRL-AM"]
[null,null,null,null,null,null,null,null,null,null,null,null,null,null,null,null,null,null,null,null,null,null,null,null,null,null,null,null,null,null,null,null,null,null,null,null,null,null,null,null,null,null,null,null,null,null,null,null,null,null,"Ukrainian-4996 - Category 3",null,null,null,null,"Luxembourg","Austria","Euro","BRL-AM"]
[null,null,null,null,null,null,null,null,null,null,null,null,null,null,null,null,null,null,null,null,null,null,null,null,null,null,null,null,null,null,null,null,null,null,null,null,null,null,null,null,null,null,null,null,null,null,null,null,null,null,"Urdu-4824 - Category 3",null,null,null,null,"Macao SAR","United States","US Dollar","BRL-AM"]
[null,null,null,null,null,null,null,null,null,null,null,null,null,null,null,null,null,null,null,null,null,null,null,null,null,null,null,null,null,null,null,null,null,null,null,null,null,null,null,null,null,null,null,null,null,null,null,null,null,null,"Uzbek (Cyrillic)-4826 - Category 3",null,null,null,null,"Macedonia","United States","US Dollar","BRL-AM"]
[null,null,null,null,null,null,null,null,null,null,null,null,null,null,null,null,null,null,null,null,null,null,null,null,null,null,null,null,null,null,null,null,null,null,null,null,null,null,null,null,null,null,null,null,null,null,null,null,null,null,"Uzbek (Latin)-4825 - Category 3",null,null,null,null,"Madagascar","United States","US Dollar","BRL-AM"]
[null,null,null,null,null,null,null,null,null,null,null,null,null,null,null,null,null,null,null,null,null,null,null,null,null,null,null,null,null,null,null,null,null,null,null,null,null,null,null,null,null,null,null,null,null,null,null,null,null,null,"Vietnamese-4997 - Category 3",null,null,null,null,"Malawi","United States","US Dollar","BRL-AM"]
[null,null,null,null,null,null,null,null,null,null,null,null,null,null,null,null,null,null,null,null,null,null,null,null,null,null,null,null,null,null,null,null,null,null,null,null,null,null,null,null,null,null,null,null,null,null,null,null,null,null,null,null,null,null,null,"Malaysia","United States","US Dollar","BRL-AM"]
[null,null,null,null,null,null,null,null,null,null,null,null,null,null,null,null,null,null,null,null,null,null,null,null,null,null,null,null,null,null,null,null,null,null,null,null,null,null,null,null,null,null,null,null,null,null,null,null,null,null,null,null,null,null,null,"Maldives","United States","US Dollar","BRL-AM"]
[null,null,null,null,null,null,null,null,null,null,null,null,null,null,null,null,null,null,null,null,null,null,null,null,null,null,null,null,null,null,null,null,null,null,null,null,null,null,null,null,null,null,null,null,null,null,null,null,null,null,null,null,null,null,null,"Mali","United States","US Dollar","BRL-AM"]
[null,null,null,null,null,null,null,null,null,null,null,null,null,null,null,null,null,null,null,null,null,null,null,null,null,null,null,null,null,null,null,null,null,null,null,null,null,null,null,null,null,null,null,null,null,null,null,null,null,null,null,null,null,null,null,"Malta","Austria","Euro","BRL-AM"]
[null,null,null,null,null,null,null,null,null,null,null,null,null,null,null,null,null,null,null,null,null,null,null,null,null,null,null,null,null,null,null,null,null,null,null,null,null,null,null,null,null,null,null,null,null,null,null,null,null,null,null,null,null,null,null,"Marshall Islands","United States","US Dollar","BRL-AM"]
[null,null,null,null,null,null,null,null,null,null,null,null,null,null,null,null,null,null,null,null,null,null,null,null,null,null,null,null,null,null,null,null,null,null,null,null,null,null,null,null,null,null,null,null,null,null,null,null,null,null,null,null,null,null,null,"Martinique","Austria","Euro","BRL-AM"]
[null,null,null,null,null,null,null,null,null,null,null,null,null,null,null,null,null,null,null,null,null,null,null,null,null,null,null,null,null,null,null,null,null,null,null,null,null,null,null,null,null,null,null,null,null,null,null,null,null,null,null,null,null,null,null,"Mauritania","United States","US Dollar","BRL-AM"]
[null,null,null,null,null,null,null,null,null,null,null,null,null,null,null,null,null,null,null,null,null,null,null,null,null,null,null,null,null,null,null,null,null,null,null,null,null,null,null,null,null,null,null,null,null,null,null,null,null,null,null,null,null,null,null,"Mauritius","United States","US Dollar","BRL-AM"]
[null,null,null,null,null,null,null,null,null,null,null,null,null,null,null,null,null,null,null,null,null,null,null,null,null,null,null,null,null,null,null,null,null,null,null,null,null,null,null,null,null,null,null,null,null,null,null,null,null,null,null,null,null,null,null,"Mayotte","Austria","Euro","BRL-AM"]
[null,null,null,null,null,null,null,null,null,null,null,null,null,null,null,null,null,null,null,null,null,null,null,null,null,null,null,null,null,null,null,null,null,null,null,null,null,null,null,null,null,null,null,null,null,null,null,null,null,null,null,null,null,null,null,"Mexico","United States","US Dollar","BRL-AM"]
[null,null,null,null,null,null,null,null,null,null,null,null,null,null,null,null,null,null,null,null,null,null,null,null,null,null,null,null,null,null,null,null,null,null,null,null,null,null,null,null,null,null,null,null,null,null,null,null,null,null,null,null,null,null,null,"Micronesia","United States","US Dollar","BRL-AM"]
[null,null,null,null,null,null,null,null,null,null,null,null,null,null,null,null,null,null,null,null,null,null,null,null,null,null,null,null,null,null,null,null,null,null,null,null,null,null,null,null,null,null,null,null,null,null,null,null,null,null,null,null,null,null,null,"Moldova","United States","US Dollar","BRL-AM"]
[null,null,null,null,null,null,null,null,null,null,null,null,null,null,null,null,null,null,null,null,null,null,null,null,null,null,null,null,null,null,null,null,null,null,null,null,null,null,null,null,null,null,null,null,null,null,null,null,null,null,null,null,null,null,null,"Monaco","Austria","Euro","BRL-AM"]
[null,null,null,null,null,null,null,null,null,null,null,null,null,null,null,null,null,null,null,null,null,null,null,null,null,null,null,null,null,null,null,null,null,null,null,null,null,null,null,null,null,null,null,null,null,null,null,null,null,null,null,null,null,null,null,"Mongolia","United States","US Dollar","BRL-AM"]
[null,null,null,null,null,null,null,null,null,null,null,null,null,null,null,null,null,null,null,null,null,null,null,null,null,null,null,null,null,null,null,null,null,null,null,null,null,null,null,null,null,null,null,null,null,null,null,null,null,null,null,null,null,null,null,"Montenegro","United States","US Dollar","BRL-AM"]
[null,null,null,null,null,null,null,null,null,null,null,null,null,null,null,null,null,null,null,null,null,null,null,null,null,null,null,null,null,null,null,null,null,null,null,null,null,null,null,null,null,null,null,null,null,null,null,null,null,null,null,null,null,null,null,"Montserrat","United States","US Dollar","BRL-AM"]
[null,null,null,null,null,null,null,null,null,null,null,null,null,null,null,null,null,null,null,null,null,null,null,null,null,null,null,null,null,null,null,null,null,null,null,null,null,null,null,null,null,null,null,null,null,null,null,null,null,null,null,null,null,null,null,"Morocco","United States","US Dollar","BRL-AM"]
[null,null,null,null,null,null,null,null,null,null,null,null,null,null,null,null,null,null,null,null,null,null,null,null,null,null,null,null,null,null,null,null,null,null,null,null,null,null,null,null,null,null,null,null,null,null,null,null,null,null,null,null,null,null,null,"Mozambique","United States","US Dollar","BRL-AM"]
[null,null,null,null,null,null,null,null,null,null,null,null,null,null,null,null,null,null,null,null,null,null,null,null,null,null,null,null,null,null,null,null,null,null,null,null,null,null,null,null,null,null,null,null,null,null,null,null,null,null,null,null,null,null,null,"Myanmar","United States","US Dollar","BRL-AM"]
[null,null,null,null,null,null,null,null,null,null,null,null,null,null,null,null,null,null,null,null,null,null,null,null,null,null,null,null,null,null,null,null,null,null,null,null,null,null,null,null,null,null,null,null,null,null,null,null,null,null,null,null,null,null,null,"Namibia","United States","US Dollar","BRL-AM"]
[null,null,null,null,null,null,null,null,null,null,null,null,null,null,null,null,null,null,null,null,null,null,null,null,null,null,null,null,null,null,null,null,null,null,null,null,null,null,null,null,null,null,null,null,null,null,null,null,null,null,null,null,null,null,null,"Nauru","United States","Australian Dollar","BRL-AM"]
[null,null,null,null,null,null,null,null,null,null,null,null,null,null,null,null,null,null,null,null,null,null,null,null,null,null,null,null,null,null,null,null,null,null,null,null,null,null,null,null,null,null,null,null,null,null,null,null,null,null,null,null,null,null,null,"Nepal","United States","US Dollar","BRL-AM"]
[null,null,null,null,null,null,null,null,null,null,null,null,null,null,null,null,null,null,null,null,null,null,null,null,null,null,null,null,null,null,null,null,null,null,null,null,null,null,null,null,null,null,null,null,null,null,null,null,null,null,null,null,null,null,null,"Netherlands Antilles","United States","US Dollar","BRL-AM"]
[null,null,null,null,null,null,null,null,null,null,null,null,null,null,null,null,null,null,null,null,null,null,null,null,null,null,null,null,null,null,null,null,null,null,null,null,null,null,null,null,null,null,null,null,null,null,null,null,null,null,null,null,null,null,null,"Netherlands, The","Austria","Euro","BRL-AM"]
[null,null,null,null,null,null,null,null,null,null,null,null,null,null,null,null,null,null,null,null,null,null,null,null,null,null,null,null,null,null,null,null,null,null,null,null,null,null,null,null,null,null,null,null,null,null,null,null,null,null,null,null,null,null,null,"New Caledonia","United States","US Dollar","BRL-AM"]
[null,null,null,null,null,null,null,null,null,null,null,null,null,null,null,null,null,null,null,null,null,null,null,null,null,null,null,null,null,null,null,null,null,null,null,null,null,null,null,null,null,null,null,null,null,null,null,null,null,null,null,null,null,null,null,"New Zealand","United States","New Zealand Dollar","BRL-AM"]
[null,null,null,null,null,null,null,null,null,null,null,null,null,null,null,null,null,null,null,null,null,null,null,null,null,null,null,null,null,null,null,null,null,null,null,null,null,null,null,null,null,null,null,null,null,null,null,null,null,null,null,null,null,null,null,"Nicaragua","United States","US Dollar","BRL-AM"]
[null,null,null,null,null,null,null,null,null,null,null,null,null,null,null,null,null,null,null,null,null,null,null,null,null,null,null,null,null,null,null,null,null,null,null,null,null,null,null,null,null,null,null,null,null,null,null,null,null,null,null,null,null,null,null,"Niger","United States","US Dollar","BRL-AM"]
[null,null,null,null,null,null,null,null,null,null,null,null,null,null,null,null,null,null,null,null,null,null,null,null,null,null,null,null,null,null,null,null,null,null,null,null,null,null,null,null,null,null,null,null,null,null,null,null,null,null,null,null,null,null,null,"Nigeria","United States","US Dollar","BRL-AM"]
[null,null,null,null,null,null,null,null,null,null,null,null,null,null,null,null,null,null,null,null,null,null,null,null,null,null,null,null,null,null,null,null,null,null,null,null,null,null,null,null,null,null,null,null,null,null,null,null,null,null,null,null,null,null,null,"Niue","United States","New Zealand Dollar","BRL-AM"]
[null,null,null,null,null,null,null,null,null,null,null,null,null,null,null,null,null,null,null,null,null,null,null,null,null,null,null,null,null,null,null,null,null,null,null,null,null,null,null,null,null,null,null,null,null,null,null,null,null,null,null,null,null,null,null,"Norfolk Island","United States","Australian Dollar","BRL-AM"]
[null,null,null,null,null,null,null,null,null,null,null,null,null,null,null,null,null,null,null,null,null,null,null,null,null,null,null,null,null,null,null,null,null,null,null,null,null,null,null,null,null,null,null,null,null,null,null,null,null,null,null,null,null,null,null,"Northern Mariana Islands","United States","US Dollar","BRL-AM"]
[null,null,null,null,null,null,null,null,null,null,null,null,null,null,null,null,null,null,null,null,null,null,null,null,null,null,null,null,null,null,null,null,null,null,null,null,null,null,null,null,null,null,null,null,null,null,null,null,null,null,null,null,null,null,null,"Norway","Norway","Norwegian Krona","BRL-AM"]
[null,null,null,null,null,null,null,null,null,null,null,null,null,null,null,null,null,null,null,null,null,null,null,null,null,null,null,null,null,null,null,null,null,null,null,null,null,null,null,null,null,null,null,null,null,null,null,null,null,null,null,null,null,null,null,"Oman","United States","US Dollar","BRL-AM"]
[null,null,null,null,null,null,null,null,null,null,null,null,null,null,null,null,null,null,null,null,null,null,null,null,null,null,null,null,null,null,null,null,null,null,null,null,null,null,null,null,null,null,null,null,null,null,null,null,null,null,null,null,null,null,null,"Pakistan","United States","US Dollar","BRL-AM"]
[null,null,null,null,null,null,null,null,null,null,null,null,null,null,null,null,null,null,null,null,null,null,null,null,null,null,null,null,null,null,null,null,null,null,null,null,null,null,null,null,null,null,null,null,null,null,null,null,null,null,null,null,null,null,null,"Palau","United States","US Dollar","BRL-AM"]
[null,null,null,null,null,null,null,null,null,null,null,null,null,null,null,null,null,null,null,null,null,null,null,null,null,null,null,null,null,null,null,null,null,null,null,null,null,null,null,null,null,null,null,null,null,null,null,null,null,null,null,null,null,null,null,"Palestinian Authority","United States","US Dollar","BRL-AM"]
[null,null,null,null,null,null,null,null,null,null,null,null,null,null,null,null,null,null,null,null,null,null,null,null,null,null,null,null,null,null,null,null,null,null,null,null,null,null,null,null,null,null,null,null,null,null,null,null,null,null,null,null,null,null,null,"Panama","United States","US Dollar","BRL-AM"]
[null,null,null,null,null,null,null,null,null,null,null,null,null,null,null,null,null,null,null,null,null,null,null,null,null,null,null,null,null,null,null,null,null,null,null,null,null,null,null,null,null,null,null,null,null,null,null,null,null,null,null,null,null,null,null,"Papua New Guinea","United States","US Dollar","BRL-AM"]
[null,null,null,null,null,null,null,null,null,null,null,null,null,null,null,null,null,null,null,null,null,null,null,null,null,null,null,null,null,null,null,null,null,null,null,null,null,null,null,null,null,null,null,null,null,null,null,null,null,null,null,null,null,null,null,"Paraguay","United States","US Dollar","BRL-AM"]
[null,null,null,null,null,null,null,null,null,null,null,null,null,null,null,null,null,null,null,null,null,null,null,null,null,null,null,null,null,null,null,null,null,null,null,null,null,null,null,null,null,null,null,null,null,null,null,null,null,null,null,null,null,null,null,"Peru","United States","US Dollar","BRL-AM"]
[null,null,null,null,null,null,null,null,null,null,null,null,null,null,null,null,null,null,null,null,null,null,null,null,null,null,null,null,null,null,null,null,null,null,null,null,null,null,null,null,null,null,null,null,null,null,null,null,null,null,null,null,null,null,null,"Philippines","United States","US Dollar","BRL-AM"]
[null,null,null,null,null,null,null,null,null,null,null,null,null,null,null,null,null,null,null,null,null,null,null,null,null,null,null,null,null,null,null,null,null,null,null,null,null,null,null,null,null,null,null,null,null,null,null,null,null,null,null,null,null,null,null,"Pitcairn Islands","United States","US Dollar","BRL-AM"]
[null,null,null,null,null,null,null,null,null,null,null,null,null,null,null,null,null,null,null,null,null,null,null,null,null,null,null,null,null,null,null,null,null,null,null,null,null,null,null,null,null,null,null,null,null,null,null,null,null,null,null,null,null,null,null,"Poland","Austria","Euro","BRL-AM"]
[null,null,null,null,null,null,null,null,null,null,null,null,null,null,null,null,null,null,null,null,null,null,null,null,null,null,null,null,null,null,null,null,null,null,null,null,null,null,null,null,null,null,null,null,null,null,null,null,null,null,null,null,null,null,null,"Portugal","Austria","Euro","BRL-AM"]
[null,null,null,null,null,null,null,null,null,null,null,null,null,null,null,null,null,null,null,null,null,null,null,null,null,null,null,null,null,null,null,null,null,null,null,null,null,null,null,null,null,null,null,null,null,null,null,null,null,null,null,null,null,null,null,"Puerto Rico","United States","US Dollar","BRL-AM"]
[null,null,null,null,null,null,null,null,null,null,null,null,null,null,null,null,null,null,null,null,null,null,null,null,null,null,null,null,null,null,null,null,null,null,null,null,null,null,null,null,null,null,null,null,null,null,null,null,null,null,null,null,null,null,null,"Qatar","United States","US Dollar","BRL-AM"]
[null,null,null,null,null,null,null,null,null,null,null,null,null,null,null,null,null,null,null,null,null,null,null,null,null,null,null,null,null,null,null,null,null,null,null,null,null,null,null,null,null,null,null,null,null,null,null,null,null,null,null,null,null,null,null,"Reunion","Austria","Euro","BRL-AM"]
[null,null,null,null,null,null,null,null,null,null,null,null,null,null,null,null,null,null,null,null,null,null,null,null,null,null,null,null,null,null,null,null,null,null,null,null,null,null,null,null,null,null,null,null,null,null,null,null,null,null,null,null,null,null,null,"Romania","Austria","Euro","BRL-AM"]
[null,null,null,null,null,null,null,null,null,null,null,null,null,null,null,null,null,null,null,null,null,null,null,null,null,null,null,null,null,null,null,null,null,null,null,null,null,null,null,null,null,null,null,null,null,null,null,null,null,null,null,null,null,null,null,"Russia","United States","Russian Ruble","BRL-AM"]
[null,null,null,null,null,null,null,null,null,null,null,null,null,null,null,null,null,null,null,null,null,null,null,null,null,null,null,null,null,null,null,null,null,null,null,null,null,null,null,null,null,null,null,null,null,null,null,null,null,null,null,null,null,null,null,"Rwanda","United States","US Dollar","BRL-AM"]
[null,null,null,null,null,null,null,null,null,null,null,null,null,null,null,null,null,null,null,null,null,null,null,null,null,null,null,null,null,null,null,null,null,null,null,null,null,null,null,null,null,null,null,null,null,null,null,null,null,null,null,null,null,null,null,"Saint Helena","Saint Helena","Pounds Sterling","BRL-AM"]
[null,null,null,null,null,null,null,null,null,null,null,null,null,null,null,null,null,null,null,null,null,null,null,null,null,null,null,null,null,null,null,null,null,null,null,null,null,null,null,null,null,null,null,null,null,null,null,null,null,null,null,null,null,null,null,"Saint Kitts and Nevis","United States","US Dollar","BRL-AM"]
[null,null,null,null,null,null,null,null,null,null,null,null,null,null,null,null,null,null,null,null,null,null,null,null,null,null,null,null,null,null,null,null,null,null,null,null,null,null,null,null,null,null,null,null,null,null,null,null,null,null,null,null,null,null,null,"Saint Lucia","United States","US Dollar","BRL-AM"]
[null,null,null,null,null,null,null,null,null,null,null,null,null,null,null,null,null,null,null,null,null,null,null,null,null,null,null,null,null,null,null,null,null,null,null,null,null,null,null,null,null,null,null,null,null,null,null,null,null,null,null,null,null,null,null,"Saint Pierre and Miquelon","United States","Canadian Dollar","BRL-AM"]
[null,null,null,null,null,null,null,null,null,null,null,null,null,null,null,null,null,null,null,null,null,null,null,null,null,null,null,null,null,null,null,null,null,null,null,null,null,null,null,null,null,null,null,null,null,null,null,null,null,null,null,null,null,null,null,"Saint Vincent and the Grenadines","United States","US Dollar","BRL-AM"]
[null,null,null,null,null,null,null,null,null,null,null,null,null,null,null,null,null,null,null,null,null,null,null,null,null,null,null,null,null,null,null,null,null,null,null,null,null,null,null,null,null,null,null,null,null,null,null,null,null,null,null,null,null,null,null,"Samoa","United States","US Dollar","BRL-AM"]
[null,null,null,null,null,null,null,null,null,null,null,null,null,null,null,null,null,null,null,null,null,null,null,null,null,null,null,null,null,null,null,null,null,null,null,null,null,null,null,null,null,null,null,null,null,null,null,null,null,null,null,null,null,null,null,"San Marino","Austria","Euro","BRL-AM"]
[null,null,null,null,null,null,null,null,null,null,null,null,null,null,null,null,null,null,null,null,null,null,null,null,null,null,null,null,null,null,null,null,null,null,null,null,null,null,null,null,null,null,null,null,null,null,null,null,null,null,null,null,null,null,null,"Sao Tomé and Príncipe","United States","US Dollar","BRL-AM"]
[null,null,null,null,null,null,null,null,null,null,null,null,null,null,null,null,null,null,null,null,null,null,null,null,null,null,null,null,null,null,null,null,null,null,null,null,null,null,null,null,null,null,null,null,null,null,null,null,null,null,null,null,null,null,null,"Saudi Arabia","United States","US Dollar","BRL-AM"]
[null,null,null,null,null,null,null,null,null,null,null,null,null,null,null,null,null,null,null,null,null,null,null,null,null,null,null,null,null,null,null,null,null,null,null,null,null,null,null,null,null,null,null,null,null,null,null,null,null,null,null,null,null,null,null,"Senegal","United States","US Dollar","BRL-AM"]
[null,null,null,null,null,null,null,null,null,null,null,null,null,null,null,null,null,null,null,null,null,null,null,null,null,null,null,null,null,null,null,null,null,null,null,null,null,null,null,null,null,null,null,null,null,null,null,null,null,null,null,null,null,null,null,"Serbia","United States","US Dollar","BRL-AM"]
[null,null,null,null,null,null,null,null,null,null,null,null,null,null,null,null,null,null,null,null,null,null,null,null,null,null,null,null,null,null,null,null,null,null,null,null,null,null,null,null,null,null,null,null,null,null,null,null,null,null,null,null,null,null,null,"Seychelles","United States","US Dollar","BRL-AM"]
[null,null,null,null,null,null,null,null,null,null,null,null,null,null,null,null,null,null,null,null,null,null,null,null,null,null,null,null,null,null,null,null,null,null,null,null,null,null,null,null,null,null,null,null,null,null,null,null,null,null,null,null,null,null,null,"Sierra Leone","United States","US Dollar","BRL-AM"]
[null,null,null,null,null,null,null,null,null,null,null,null,null,null,null,null,null,null,null,null,null,null,null,null,null,null,null,null,null,null,null,null,null,null,null,null,null,null,null,null,null,null,null,null,null,null,null,null,null,null,null,null,null,null,null,"Singapore","United States","US Dollar","BRL-AM"]
[null,null,null,null,null,null,null,null,null,null,null,null,null,null,null,null,null,null,null,null,null,null,null,null,null,null,null,null,null,null,null,null,null,null,null,null,null,null,null,null,null,null,null,null,null,null,null,null,null,null,null,null,null,null,null,"Slovakia","Austria","Euro","BRL-AM"]
[null,null,null,null,null,null,null,null,null,null,null,null,null,null,null,null,null,null,null,null,null,null,null,null,null,null,null,null,null,null,null,null,null,null,null,null,null,null,null,null,null,null,null,null,null,null,null,null,null,null,null,null,null,null,null,"Slovenia","Austria","Euro","BRL-AM"]
[null,null,null,null,null,null,null,null,null,null,null,null,null,null,null,null,null,null,null,null,null,null,null,null,null,null,null,null,null,null,null,null,null,null,null,null,null,null,null,null,null,null,null,null,null,null,null,null,null,null,null,null,null,null,null,"Solomon Islands","United States","US Dollar","BRL-AM"]
[null,null,null,null,null,null,null,null,null,null,null,null,null,null,null,null,null,null,null,null,null,null,null,null,null,null,null,null,null,null,null,null,null,null,null,null,null,null,null,null,null,null,null,null,null,null,null,null,null,null,null,null,null,null,null,"Somalia","United States","US Dollar","BRL-AM"]
[null,null,null,null,null,null,null,null,null,null,null,null,null,null,null,null,null,null,null,null,null,null,null,null,null,null,null,null,null,null,null,null,null,null,null,null,null,null,null,null,null,null,null,null,null,null,null,null,null,null,null,null,null,null,null,"South Africa","United States","US Dollar","BRL-AM"]
[null,null,null,null,null,null,null,null,null,null,null,null,null,null,null,null,null,null,null,null,null,null,null,null,null,null,null,null,null,null,null,null,null,null,null,null,null,null,null,null,null,null,null,null,null,null,null,null,null,null,null,null,null,null,null,"South Georgia and the South Sandwich Islands","United States","US Dollar","BRL-AM"]
[null,null,null,null,null,null,null,null,null,null,null,null,null,null,null,null,null,null,null,null,null,null,null,null,null,null,null,null,null,null,null,null,null,null,null,null,null,null,null,null,null,null,null,null,null,null,null,null,null,null,null,null,null,null,null,"Spain","Austria","Euro","BRL-AM"]
[null,null,null,null,null,null,null,null,null,null,null,null,null,null,null,null,null,null,null,null,null,null,null,null,null,null,null,null,null,null,null,null,null,null,null,null,null,null,null,null,null,null,null,null,null,null,null,null,null,null,null,null,null,null,null,"Sri Lanka","United States","US Dollar","BRL-AM"]
[null,null,null,null,null,null,null,null,null,null,null,null,null,null,null,null,null,null,null,null,null,null,null,null,null,null,null,null,null,null,null,null,null,null,null,null,null,null,null,null,null,null,null,null,null,null,null,null,null,null,null,null,null,null,null,"Sudan","United States","US Dollar","BRL-AM"]
[null,null,null,null,null,null,null,null,null,null,null,null,null,null,null,null,null,null,null,null,null,null,null,null,null,null,null,null,null,null,null,null,null,null,null,null,null,null,null,null,null,null,null,null,null,null,null,null,null,null,null,null,null,null,null,"Suriname","United States","US Dollar","BRL-AM"]
[null,null,null,null,null,null,null,null,null,null,null,null,null,null,null,null,null,null,null,null,null,null,null,null,null,null,null,null,null,null,null,null,null,null,null,null,null,null,null,null,null,null,null,null,null,null,null,null,null,null,null,null,null,null,null,"Svalbard and Jan Mayen","Svalbard and Jan Mayen","Norwegian Krona","BRL-AM"]
[null,null,null,null,null,null,null,null,null,null,null,null,null,null,null,null,null,null,null,null,null,null,null,null,null,null,null,null,null,null,null,null,null,null,null,null,null,null,null,null,null,null,null,null,null,null,null,null,null,null,null,null,null,null,null,"Swaziland","United States","US Dollar","BRL-AM"]
[null,null,null,null,null,null,null,null,null,null,null,null,null,null,null,null,null,null,null,null,null,null,null,null,null,null,null,null,null,null,null,null,null,null,null,null,null,null,null,null,null,null,null,null,null,null,null,null,null,null,null,null,null,null,null,"Sweden","Sweden","Swedish Krowne","BRL-AM"]
[null,null,null,null,null,null,null,null,null,null,null,null,null,null,null,null,null,null,null,null,null,null,null,null,null,null,null,null,null,null,null,null,null,null,null,null,null,null,null,null,null,null,null,null,null,null,null,null,null,null,null,null,null,null,null,"Switzerland","Switzerland","Swiss Franc","BRL-AM"]
[null,null,null,null,null,null,null,null,null,null,null,null,null,null,null,null,null,null,null,null,null,null,null,null,null,null,null,null,null,null,null,null,null,null,null,null,null,null,null,null,null,null,null,null,null,null,null,null,null,null,null,null,null,null,null,"Syria","United States","US Dollar","BRL-AM"]
[null,null,null,null,null,null,null,null,null,null,null,null,null,null,null,null,null,null,null,null,null,null,null,null,null,null,null,null,null,null,null,null,null,null,null,null,null,null,null,null,null,null,null,null,null,null,null,null,null,null,null,null,null,null,null,"Taiwan","United States","US Dollar","BRL-AM"]
[null,null,null,null,null,null,null,null,null,null,null,null,null,null,null,null,null,null,null,null,null,null,null,null,null,null,null,null,null,null,null,null,null,null,null,null,null,null,null,null,null,null,null,null,null,null,null,null,null,null,null,null,null,null,null,"Tajikistan","United States","US Dollar","BRL-AM"]
[null,null,null,null,null,null,null,null,null,null,null,null,null,null,null,null,null,null,null,null,null,null,null,null,null,null,null,null,null,null,null,null,null,null,null,null,null,null,null,null,null,null,null,null,null,null,null,null,null,null,null,null,null,null,null,"Tanzania","United States","US Dollar","BRL-AM"]
[null,null,null,null,null,null,null,null,null,null,null,null,null,null,null,null,null,null,null,null,null,null,null,null,null,null,null,null,null,null,null,null,null,null,null,null,null,null,null,null,null,null,null,null,null,null,null,null,null,null,null,null,null,null,null,"Thailand","United States","US Dollar","BRL-AM"]
[null,null,null,null,null,null,null,null,null,null,null,null,null,null,null,null,null,null,null,null,null,null,null,null,null,null,null,null,null,null,null,null,null,null,null,null,null,null,null,null,null,null,null,null,null,null,null,null,null,null,null,null,null,null,null,"Timor-Leste","United States","US Dollar","BRL-AM"]
[null,null,null,null,null,null,null,null,null,null,null,null,null,null,null,null,null,null,null,null,null,null,null,null,null,null,null,null,null,null,null,null,null,null,null,null,null,null,null,null,null,null,null,null,null,null,null,null,null,null,null,null,null,null,null,"Togo","United States","US Dollar","BRL-AM"]
[null,null,null,null,null,null,null,null,null,null,null,null,null,null,null,null,null,null,null,null,null,null,null,null,null,null,null,null,null,null,null,null,null,null,null,null,null,null,null,null,null,null,null,null,null,null,null,null,null,null,null,null,null,null,null,"Tokelau","United States","New Zealand Dollar","BRL-AM"]
[null,null,null,null,null,null,null,null,null,null,null,null,null,null,null,null,null,null,null,null,null,null,null,null,null,null,null,null,null,null,null,null,null,null,null,null,null,null,null,null,null,null,null,null,null,null,null,null,null,null,null,null,null,null,null,"Tonga","United States","US Dollar","BRL-AM"]
[null,null,null,null,null,null,null,null,null,null,null,null,null,null,null,null,null,null,null,null,null,null,null,null,null,null,null,null,null,null,null,null,null,null,null,null,null,null,null,null,null,null,null,null,null,null,null,null,null,null,null,null,null,null,null,"Trinidad and Tobago","United States","US Dollar","BRL-AM"]
[null,null,null,null,null,null,null,null,null,null,null,null,null,null,null,null,null,null,null,null,null,null,null,null,null,null,null,null,null,null,null,null,null,null,null,null,null,null,null,null,null,null,null,null,null,null,null,null,null,null,null,null,null,null,null,"Tunisia","United States","US Dollar","BRL-AM"]
[null,null,null,null,null,null,null,null,null,null,null,null,null,null,null,null,null,null,null,null,null,null,null,null,null,null,null,null,null,null,null,null,null,null,null,null,null,null,null,null,null,null,null,null,null,null,null,null,null,null,null,null,null,null,null,"Turkey","United States","US Dollar","BRL-AM"]
[null,null,null,null,null,null,null,null,null,null,null,null,null,null,null,null,null,null,null,null,null,null,null,null,null,null,null,null,null,null,null,null,null,null,null,null,null,null,null,null,null,null,null,null,null,null,null,null,null,null,null,null,null,null,null,"Turkmenistan","United States","US Dollar","BRL-AM"]
[null,null,null,null,null,null,null,null,null,null,null,null,null,null,null,null,null,null,null,null,null,null,null,null,null,null,null,null,null,null,null,null,null,null,null,null,null,null,null,null,null,null,null,null,null,null,null,null,null,null,null,null,null,null,null,"Turks and Caicos Islands","United States","US Dollar","BRL-AM"]
[null,null,null,null,null,null,null,null,null,null,null,null,null,null,null,null,null,null,null,null,null,null,null,null,null,null,null,null,null,null,null,null,null,null,null,null,null,null,null,null,null,null,null,null,null,null,null,null,null,null,null,null,null,null,null,"Tuvalu","United States","Australian Dollar","BRL-AM"]
[null,null,null,null,null,null,null,null,null,null,null,null,null,null,null,null,null,null,null,null,null,null,null,null,null,null,null,null,null,null,null,null,null,null,null,null,null,null,null,null,null,null,null,null,null,null,null,null,null,null,null,null,null,null,null,"U.S. Minor Outlying Islands","United States","US Dollar","BRL-AM"]
[null,null,null,null,null,null,null,null,null,null,null,null,null,null,null,null,null,null,null,null,null,null,null,null,null,null,null,null,null,null,null,null,null,null,null,null,null,null,null,null,null,null,null,null,null,null,null,null,null,null,null,null,null,null,null,"Uganda","United States","US Dollar","BRL-AM"]
[null,null,null,null,null,null,null,null,null,null,null,null,null,null,null,null,null,null,null,null,null,null,null,null,null,null,null,null,null,null,null,null,null,null,null,null,null,null,null,null,null,null,null,null,null,null,null,null,null,null,null,null,null,null,null,"Ukraine","United States","US Dollar","BRL-AM"]
[null,null,null,null,null,null,null,null,null,null,null,null,null,null,null,null,null,null,null,null,null,null,null,null,null,null,null,null,null,null,null,null,null,null,null,null,null,null,null,null,null,null,null,null,null,null,null,null,null,null,null,null,null,null,null,"United Arab Emirates","United States","US Dollar","BRL-AM"]
[null,null,null,null,null,null,null,null,null,null,null,null,null,null,null,null,null,null,null,null,null,null,null,null,null,null,null,null,null,null,null,null,null,null,null,null,null,null,null,null,null,null,null,null,null,null,null,null,null,null,null,null,null,null,null,"United Kingdom","United Kingdom","Pounds Sterling","BRL-AM"]
[null,null,null,null,null,null,null,null,null,null,null,null,null,null,null,null,null,null,null,null,null,null,null,null,null,null,null,null,null,null,null,null,null,null,null,null,null,null,null,null,null,null,null,null,null,null,null,null,null,null,null,null,null,null,null,"United States","United States","US Dollar","BRL-AM"]
[null,null,null,null,null,null,null,null,null,null,null,null,null,null,null,null,null,null,null,null,null,null,null,null,null,null,null,null,null,null,null,null,null,null,null,null,null,null,null,null,null,null,null,null,null,null,null,null,null,null,null,null,null,null,null,"Uruguay","United States","US Dollar","BRL-AM"]
[null,null,null,null,null,null,null,null,null,null,null,null,null,null,null,null,null,null,null,null,null,null,null,null,null,null,null,null,null,null,null,null,null,null,null,null,null,null,null,null,null,null,null,null,null,null,null,null,null,null,null,null,null,null,null,"Uzbekistan","United States","US Dollar","BRL-AM"]
[null,null,null,null,null,null,null,null,null,null,null,null,null,null,null,null,null,null,null,null,null,null,null,null,null,null,null,null,null,null,null,null,null,null,null,null,null,null,null,null,null,null,null,null,null,null,null,null,null,null,null,null,null,null,null,"Vanuatu","United States","US Dollar","BRL-AM"]
[null,null,null,null,null,null,null,null,null,null,null,null,null,null,null,null,null,null,null,null,null,null,null,null,null,null,null,null,null,null,null,null,null,null,null,null,null,null,null,null,null,null,null,null,null,null,null,null,null,null,null,null,null,null,null,"Vatican City","Austria","Euro","BRL-AM"]
[null,null,null,null,null,null,null,null,null,null,null,null,null,null,null,null,null,null,null,null,null,null,null,null,null,null,null,null,null,null,null,null,null,null,null,null,null,null,null,null,null,null,null,null,null,null,null,null,null,null,null,null,null,null,null,"Venezuela","United States","US Dollar","BRL-AM"]
[null,null,null,null,null,null,null,null,null,null,null,null,null,null,null,null,null,null,null,null,null,null,null,null,null,null,null,null,null,null,null,null,null,null,null,null,null,null,null,null,null,null,null,null,null,null,null,null,null,null,null,null,null,null,null,"Vietnam","United States","US Dollar","BRL-AM"]
[null,null,null,null,null,null,null,null,null,null,null,null,null,null,null,null,null,null,null,null,null,null,null,null,null,null,null,null,null,null,null,null,null,null,null,null,null,null,null,null,null,null,null,null,null,null,null,null,null,null,null,null,null,null,null,"Virgin Islands, British","United States","US Dollar","BRL-AM"]
[null,null,null,null,null,null,null,null,null,null,null,null,null,null,null,null,null,null,null,null,null,null,null,null,null,null,null,null,null,null,null,null,null,null,null,null,null,null,null,null,null,null,null,null,null,null,null,null,null,null,null,null,null,null,null,"Virgin Islands, U.S.","United States","US Dollar","BRL-AM"]
[null,null,null,null,null,null,null,null,null,null,null,null,null,null,null,null,null,null,null,null,null,null,null,null,null,null,null,null,null,null,null,null,null,null,null,null,null,null,null,null,null,null,null,null,null,null,null,null,null,null,null,null,null,null,null,"Wallis and Futuna","United States","US Dollar","BRL-AM"]
[null,null,null,null,null,null,null,null,null,null,null,null,null,null,null,null,null,null,null,null,null,null,null,null,null,null,null,null,null,null,null,null,null,null,null,null,null,null,null,null,null,null,null,null,null,null,null,null,null,null,null,null,null,null,null,"Western Sahara","United States","US Dollar","BRL-AM"]
[null,null,null,null,null,null,null,null,null,null,null,null,null,null,null,null,null,null,null,null,null,null,null,null,null,null,null,null,null,null,null,null,null,null,null,null,null,null,null,null,null,null,null,null,null,null,null,null,null,null,null,null,null,null,null,"Yemen","United States","US Dollar","BRL-AM"]
[null,null,null,null,null,null,null,null,null,null,null,null,null,null,null,null,null,null,null,null,null,null,null,null,null,null,null,null,null,null,null,null,null,null,null,null,null,null,null,null,null,null,null,null,null,null,null,null,null,null,null,null,null,null,null,"Zambia","United States","US Dollar","BRL-AM"]
[null,null,null,null,null,null,null,null,null,null,null,null,null,null,null,null,null,null,null,null,null,null,null,null,null,null,null,null,null,null,null,null,null,null,null,null,null,null,null,null,null,null,null,null,null,null,null,null,null,null,null,null,null,null,null,"Zimbabwe","United States","US Dollar","BRL-AM"]

{"sheet":"GP Availability","index":10,"n_rows":31,"n_cols":278,"rows_kept":31,"cut":false,"hidden":true,"merged":[]}
[]
[null,null,"ALL CHECK",null,null,null,{"$f":"COUNTIF(Table20[ALL - Africa],\"ALL\")","v":14},{"$f":"SUM(Table20[Algeria])","v":14},{"$f":"SUM(Table20[Angola])","v":14},{"$f":"SUM(Table20[Benin])","v":14},{"$f":"SUM(Table20[Botswana])","v":14},{"$f":"SUM(Table20[Burkina Faso])","v":14},{"$f":"SUM(Table20[Burundi])","v":14},{"$f":"SUM(Table20[Cameroon])","v":14},{"$f":"SUM(Table20[Cape Verde])","v":14},{"$f":"SUM(Table20[Central African Republic])","v":14},{"$f":"SUM(Table20[Chad])","v":14},{"$f":"SUM(Table20[Comoros])","v":14},{"$f":"SUM(Table20[Congo])","v":14},{"$f":"SUM(Table20[Congo (DRC)])","v":14},{"$f":"SUM(Table20[Côte d''Ivoire])","v":14},{"$f":"SUM(Table20[Djibouti])","v":14},{"$f":"SUM(Table20[Egypt])","v":14},{"$f":"SUM(Table20[Equatorial Guinea])","v":14},{"$f":"SUM(Table20[Eritrea])","v":14},{"$f":"SUM(Table20[Ethiopia])","v":14},{"$f":"SUM(Table20[French Polynesia])","v":14},{"$f":"SUM(Table20[Gabon])","v":14},{"$f":"SUM(Table20[Gambia, The])","v":14},{"$f":"SUM(Table20[Ghana])","v":14},{"$f":"SUM(Table20[Guinea])","v":14},{"$f":"SUM(Table20[Guinea-Bissau])","v":14},{"$f":"SUM(Table20[Kenya])","v":14},{"$f":"SUM(Table20[Lesotho])","v":14},{"$f":"SUM(Table20[Liberia])","v":14},{"$f":"SUM(Table20[Libya])","v":14},{"$f":"SUM(Table20[Madagascar])","v":14},{"$f":"SUM(Table20[Malawi])","v":14},{"$f":"SUM(Table20[Mali])","v":14},{"$f":"SUM(Table20[Mauritania])","v":14},{"$f":"SUM(Table20[Mauritius])","v":14},{"$f":"SUM(Table20[Morocco])","v":14},{"$f":"SUM(Table20[Mozambique])","v":14},{"$f":"SUM(Table20[Namibia])","v":14},{"$f":"SUM(Table20[New Caledonia])","v":14},{"$f":"SUM(Table20[Niger])","v":14},{"$f":"SUM(Table20[Nigeria])","v":14},{"$f":"SUM(Table20[Rwanda])","v":14},{"$f":"SUM(Table20[Sao Tomé and Príncipe])","v":14},{"$f":"SUM(Table20[Senegal])","v":14},{"$f":"SUM(Table20[Seychelles])","v":14},{"$f":"SUM(Table20[Sierra Leone])","v":14},{"$f":"SUM(Table20[Somalia])","v":14},{"$f":"SUM(Table20[Sudan])","v":14},{"$f":"SUM(Table20[Swaziland])","v":14},{"$f":"SUM(Table20[Tanzania])","v":14},{"$f":"SUM(Table20[Togo])","v":14},{"$f":"SUM(Table20[Tunisia])","v":14},{"$f":"SUM(Table20[Uganda])","v":14},{"$f":"SUM(Table20[Western Sahara])","v":14},{"$f":"SUM(Table20[Zambia])","v":14},{"$f":"SUM(Table20[Zimbabwe])","v":14},{"$f":"SUM(Table20[ALL - APOC United States ])","v":0},{"$f":"SUM(Table20[American Samoa])","v":15},{"$f":"SUM(Table20[Guam])","v":15},{"$f":"SUM(Table20[Marshall Islands])","v":15},{"$f":"SUM(Table20[Northern Mariana Islands])","v":15},{"$f":"SUM(Table20[ALL - Australia])","v":0},{"$f":"SUM(Table20[Australia])","v":14},{"$f":"SUM(Table20[Christmas Island])","v":14},{"$f":"SUM(Table20[Cocos (Keeling) Islands])","v":14},{"$f":"SUM(Table20[Heard Island and McDonald Islands])","v":14},{"$f":"SUM(Table20[Kiribati])","v":14},{"$f":"SUM(Table20[Nauru])","v":14},{"$f":"SUM(Table20[Norfolk Island])","v":14},{"$f":"SUM(Table20[Tuvalu])","v":14},{"$f":"SUM(Table20[ALL - Canada])","v":0},{"$f":"SUM(Table20[Canada])","v":16},{"$f":"SUM(Table20[Saint Pierre and Miquelon])","v":16},{"$f":"SUM(Table20[ALL - Central Asia 1 - CEE 1 ])","v":0},{"$f":"SUM(Table20[Afghanistan])","v":14},{"$f":"SUM(Table20[Kyrgyzstan])","v":14},{"$f":"SUM(Table20[Mongolia])","v":14},{"$f":"SUM(Table20[Pakistan])","v":14},{"$f":"SUM(Table20[ALL - Central Asia 2 - CEE 2])","v":0},{"$f":"SUM(Table20[Azerbaijan])","v":14},{"$f":"SUM(Table20[Kazakhstan])","v":14},{"$f":"SUM(Table20[Tajikistan])","v":14},{"$f":"SUM(Table20[Turkmenistan])","v":14},{"$f":"SUM(Table20[Uzbekistan])","v":14},{"$f":"SUM(Table20[ALL - Chile])","v":0},{"$f":"SUM(Table20[Chile])","v":16},{"$f":"SUM(Table20[ALL - China])","v":0},{"$f":"SUM(Table20[China])","v":14},{"$f":"SUM(Table20[ALL - Colombia])","v":0},{"$f":"SUM(Table20[Colombia])","v":16},{"$f":"SUM(Table20[ALL - Denmark2])","v":0},{"$f":"SUM(Table20[Denmark])","v":14},{"$f":"SUM(Table20[Faroe Islands])","v":14},{"$f":"SUM(Table20[Greenland])","v":14},{"$f":"SUM(Table20[ALL - Eastern Euope 1])","v":0},{"$f":"SUM(Table20[Albania])","v":14},{"$f":"SUM(Table20[Bosnia and Herzegovina])","v":14},{"$f":"SUM(Table20[Macedonia])","v":14},{"$f":"SUM(Table20[Montenegro])","v":14},{"$f":"SUM(Table20[ALL - Eastern Europe 2])","v":0},{"$f":"SUM(Table20[Armenia])","v":14},{"$f":"SUM(Table20[Belarus])","v":14},{"$f":"SUM(Table20[Georgia])","v":14},{"$f":"SUM(Table20[Moldova])","v":14},{"$f":"SUM(Table20[Ukraine])","v":14},{"$f":"SUM(Table20[ALL - Eurozone])","v":0},{"$f":"SUM(Table20[Andorra])","v":14},{"$f":"SUM(Table20[Austria])","v":14},{"$f":"SUM(Table20[Belgium])","v":14},{"$f":"SUM(Table20[Bulgaria])","v":14},{"$f":"SUM(Table20[Croatia])","v":14},{"$f":"SUM(Table20[Cyprus])","v":14},{"$f":"SUM(Table20[Czech Republic])","v":14},{"$f":"SUM(Table20[Estonia])","v":14},{"$f":"SUM(Table20[Finland])","v":14},{"$f":"SUM(Table20[France])","v":14},{"$f":"SUM(Table20[French Guiana])","v":14},{"$f":"SUM(Table20[French Southern and Antarctic Lands])","v":14},{"$f":"SUM(Table20[Germany])","v":14},{"$f":"SUM(Table20[Greece])","v":14},{"$f":"SUM(Table20[Guadeloupe])","v":14},{"$f":"SUM(Table20[Hungary])","v":14},{"$f":"SUM(Table20[Iceland])","v":14},null,{"$f":"SUM(Table20[Italy])","v":14},{"$f":"SUM(Table20[Latvia])","v":14},{"$f":"SUM(Table20[Lithuania])","v":14},{"$f":"SUM(Table20[Luxembourg])","v":14},{"$f":"SUM(Table20[Malta])","v":14},{"$f":"SUM(Table20[Martinique])","v":14},{"$f":"SUM(Table20[Mayotte])","v":14},{"$f":"SUM(Table20[Monaco])","v":14},{"$f":"SUM(Table20[Netherlands, The])","v":14},{"$f":"SUM(Table20[Poland])","v":14},{"$f":"SUM(Table20[Portugal])","v":14},{"$f":"SUM(Table20[Reunion])","v":14},{"$f":"SUM(Table20[Romania])","v":14},{"$f":"SUM(Table20[San Marino])","v":14},{"$f":"SUM(Table20[Slovakia])","v":14},{"$f":"SUM(Table20[Slovenia])","v":14},{"$f":"SUM(Table20[Spain])","v":14},{"$f":"SUM(Table20[Vatican City])","v":14},{"$f":"SUM(Table20[ALL  - India])","v":0},{"$f":"SUM(Table20[India])","v":10},{"$f":"SUM(Table20[ALL - Japan])","v":0},{"$f":"SUM(Table20[Japan])","v":14},{"$f":"SUM(Table20[ALL - Latam Caribbean])","v":0},{"$f":"SUM(Table20[Anguilla])","v":16},{"$f":"SUM(Table20[Antarctica])","v":16},{"$f":"SUM(Table20[Antigua and Barbuda])","v":16},{"$f":"SUM(Table20[Aruba])","v":16},{"$f":"SUM(Table20[Bahamas, The])","v":16},{"$f":"SUM(Table20[Barbados])","v":16},{"$f":"SUM(Table20[Cuba])","v":16},{"$f":"SUM(Table20[Dominica])","v":16},{"$f":"SUM(Table20[Grenada])","v":16},{"$f":"SUM(Table20[Guyana])","v":16},{"$f":"SUM(Table20[Haiti])","v":16},{"$f":"SUM(Table20[Jamaica])","v":16},{"$f":"SUM(Table20[Montserrat])","v":16},{"$f":"SUM(Table20[Netherlands Antilles])","v":16},{"$f":"SUM(Table20[Saint Kitts and Nevis])","v":16},{"$f":"SUM(Table20[Saint Lucia])","v":16},{"$f":"SUM(Table20[Saint Vincent and the Grenadines])","v":16},{"$f":"SUM(Table20[Suriname])","v":16},{"$f":"SUM(Table20[Trinidad and Tobago])","v":16},{"$f":"SUM(Table20[Turks and Caicos Islands])","v":16},{"$f":"SUM(Table20[Virgin Islands, British])","v":16},{"$f":"SUM(Table20[ALL - Latam PR/BM/CI/VI])","v":0},{"$f":"SUM(Table20[Bermuda])","v":15},{"$f":"SUM(Table20[Cayman Islands])","v":15},{"$f":"SUM(Table20[Puerto Rico])","v":15},{"$f":"SUM(Table20[Virgin Islands, U.S.])","v":15},{"$f":"SUM(Table20[ALL - Mexico])","v":0},{"$f":"SUM(Table20[Mexico])","v":16},{"$f":"SUM(Table20[ALL - Middle East])","v":0},{"$f":"SUM(Table20[Bahrain])","v":14},{"$f":"SUM(Table20[Palestinian Authority])","v":14},{"$f":"SUM(Table20[Iran])","v":14},{"$f":"SUM(Table20[Iraq])","v":14},{"$f":"SUM(Table20[Israel])","v":14},{"$f":"SUM(Table20[Jordan])","v":14},{"$f":"SUM(Table20[Kuwait])","v":14},{"$f":"SUM(Table20[Lebanon])","v":14},{"$f":"SUM(Table20[Oman])","v":14},{"$f":"SUM(Table20[Qatar])","v":14},{"$f":"SUM(Table20[Saudi Arabia])","v":14},{"$f":"SUM(Table20[Syria])","v":14},{"$f":"SUM(Table20[United Arab Emirates])","v":14},{"$f":"SUM(Table20[Yemen])","v":14},{"$f":"SUM(Table20[ALL - New Zealand])","v":0},{"$f":"SUM(Table20[Cook Islands])","v":14},{"$f":"SUM(Table20[New Zealand])","v":14},{"$f":"SUM(Table20[Niue])","v":14},{"$f":"SUM(Table20[Tokelau])","v":14},{"$f":"SUM(Table20[ALL - Norway2])","v":0},{"$f":"SUM(Table20[Bouvet Island])","v":14},{"$f":"SUM(Table20[Norway])","v":14},{"$f":"SUM(Table20[Svalbard and Jan Mayen])","v":14},{"$f":"SUM(Table20[ALL - Rest of Latam])","v":0},{"$f":"SUM(Table20[Argentina])","v":16},{"$f":"SUM(Table20[Belize])","v":16},{"$f":"SUM(Table20[Bolivia])","v":16},{"$f":"SUM(Table20[Brazil])","v":16},{"$f":"SUM(Table20[Costa Rica])","v":16},{"$f":"SUM(Table20[Dominican Republic])","v":16},{"$f":"SUM(Table20[Ecuador])","v":16},{"$f":"SUM(Table20[El Salvador])","v":16},{"$f":"SUM(Table20[Falkland Islands (Islas Malvinas)])","v":16},{"$f":"SUM(Table20[Guatemala])","v":16},{"$f":"SUM(Table20[Honduras])","v":16},{"$f":"SUM(Table20[Nicaragua])","v":16},{"$f":"SUM(Table20[Panama])","v":16},{"$f":"SUM(Table20[Paraguay])","v":16},{"$f":"SUM(Table20[Peru])","v":16},{"$f":"SUM(Table20[South Georgia and the South Sandwich Islands])","v":16},{"$f":"SUM(Table20[Uruguay])","v":16},{"$f":"SUM(Table20[Venezuela])","v":16},{"$f":"SUM(Table20[ALL - Russia])","v":0},{"$f":"SUM(Table20[Russia])","v":14},{"$f":"SUM(Table20[ALL - Serbia])","v":0},{"$f":"SUM(Table20[Serbia])","v":14},{"$f":"SUM(Table20[ALL - South Africa])","v":0},{"$f":"SUM(Table20[South Africa])","v":14},{"$f":"SUM(Table20[ALL - South East Asia])","v":0},{"$f":"SUM(Table20[Bangladesh])","v":14},{"$f":"SUM(Table20[Bhutan])","v":14},{"$f":"SUM(Table20[British Indian Ocean Territory])","v":14},{"$f":"SUM(Table20[Brunei])","v":14},{"$f":"SUM(Table20[Cambodia])","v":14},{"$f":"SUM(Table20[Fiji Islands])","v":14},{"$f":"SUM(Table20[Hong Kong SAR])","v":14},{"$f":"SUM(Table20[Indonesia])","v":14},{"$f":"SUM(Table20[Korea, North])","v":14},{"$f":"SUM(Table20[Korea, South])","v":14},{"$f":"SUM(Table20[Laos])","v":14},{"$f":"SUM(Table20[Macao SAR])","v":14},{"$f":"SUM(Table20[Malaysia])","v":14},{"$f":"SUM(Table20[Maldives])","v":14},{"$f":"SUM(Table20[Micronesia])","v":14},{"$f":"SUM(Table20[Myanmar])","v":14},{"$f":"SUM(Table20[Nepal])","v":14},{"$f":"SUM(Table20[Palau])","v":14},{"$f":"SUM(Table20[Papua New Guinea])","v":14},{"$f":"SUM(Table20[Philippines])","v":14},{"$f":"SUM(Table20[Pitcairn Islands])","v":14},{"$f":"SUM(Table20[Samoa])","v":14},{"$f":"SUM(Table20[Singapore])","v":14},{"$f":"SUM(Table20[Solomon Islands])","v":14},{"$f":"SUM(Table20[Sri Lanka])","v":14},{"$f":"SUM(Table20[Taiwan])","v":14},{"$f":"SUM(Table20[Thailand])","v":14},{"$f":"SUM(Table20[Timor-Leste])","v":14},{"$f":"SUM(Table20[Tonga])","v":14},{"$f":"SUM(Table20[Vanuatu])","v":14},{"$f":"SUM(Table20[Vietnam])","v":14},{"$f":"SUM(Table20[Wallis and Futuna])","v":14},{"$f":"SUM(Table20[ALL - Sweden2])","v":0},{"$f":"SUM(Table20[Sweden])","v":14},{"$f":"SUM(Table20[ALL - Switzerland2])","v":0},{"$f":"SUM(Table20[Liechtenstein])","v":14},{"$f":"SUM(Table20[Switzerland])","v":14},{"$f":"SUM(Table20[ALL - Turkey])","v":0},{"$f":"SUM(Table20[Turkey])","v":14},{"$f":"SUM(Table20[ALL - United Kingdom2])","v":0},{"$f":"SUM(Table20[Gibraltar])","v":14},{"$f":"SUM(Table20[Saint Helena])","v":14},{"$f":"SUM(Table20[United Kingdom])","v":14},{"$f":"SUM(Table20[ALL - United States])","v":0},{"$f":"COUNTA(JP4:JP31)","v":20}]
[null,null,"VERSION Availablity"]
[null,"SKU","Item Description","Offering","Version","Granule ID","ALL - Africa","Algeria","Angola","Benin","Botswana","Burkina Faso","Burundi","Cameroon","Cape Verde","Central African Republic","Chad","Comoros","Congo","Congo (DRC)","Côte d'Ivoire","Djibouti","Egypt","Equatorial Guinea","Eritrea","Ethiopia","French Polynesia","Gabon","Gambia, The","Ghana","Guinea","Guinea-Bissau","Kenya","Lesotho","Liberia","Libya","Madagascar","Malawi","Mali","Mauritania","Mauritius","Morocco","Mozambique","Namibia","New Caledonia","Niger","Nigeria","Rwanda","Sao Tomé and Príncipe","Senegal","Seychelles","Sierra Leone","Somalia","Sudan","Swaziland","Tanzania","Togo","Tunisia","Uganda","Western Sahara","Zambia","Zimbabwe","ALL - APOC United States ","American Samoa","Guam","Marshall Islands","Northern Mariana Islands","ALL - Australia","Australia","Christmas Island","Cocos (Keeling) Islands","Heard Island and McDonald Islands","Kiribati","Nauru","Norfolk Island","Tuvalu","ALL - Canada","Canada","Saint Pierre and Miquelon","ALL - Central Asia 1 - CEE 1 ","Afghanistan","Kyrgyzstan","Mongolia","Pakistan","ALL - Central Asia 2 - CEE 2","Azerbaijan","Kazakhstan","Tajikistan","Turkmenistan","Uzbekistan","ALL - Chile","Chile","ALL - China","China","ALL - Colombia","Colombia","ALL - Denmark2","Denmark","Faroe Islands","Greenland","ALL - Eastern Euope 1","Albania","Bosnia and Herzegovina","Macedonia","Montenegro","ALL - Eastern Europe 2","Armenia","Belarus","Georgia","Moldova","Ukraine","ALL - Eurozone","Andorra","Austria","Belgium","Bulgaria","Croatia","Cyprus","Czech Republic","Estonia","Finland","France","French Guiana","French Southern and Antarctic Lands","Germany","Greece","Guadeloupe","Hungary","Iceland","Ireland, Republic of","Italy","Latvia","Lithuania","Luxembourg","Malta","Martinique","Mayotte","Monaco","Netherlands, The","Poland","Portugal","Reunion","Romania","San Marino","Slovakia","Slovenia","Spain","Vatican City","ALL  - India","India","ALL - Japan","Japan","ALL - Latam Caribbean","Anguilla","Antarctica","Antigua and Barbuda","Aruba","Bahamas, The","Barbados","Cuba","Dominica","Grenada","Guyana","Haiti","Jamaica","Montserrat","Netherlands Antilles","Saint Kitts and Nevis","Saint Lucia","Saint Vincent and the Grenadines","Suriname","Trinidad and Tobago","Turks and Caicos Islands","Virgin Islands, British","ALL - Latam PR/BM/CI/VI","Bermuda","Cayman Islands","Puerto Rico","Virgin Islands, U.S.","ALL - Mexico","Mexico","ALL - Middle East","Bahrain","Palestinian Authority","Iran","Iraq","Israel","Jordan","Kuwait","Lebanon","Oman","Qatar","Saudi Arabia","Syria","United Arab Emirates","Yemen","ALL - New Zealand","Cook Islands","New Zealand","Niue","Tokelau","ALL - Norway2","Bouvet Island","Norway","Svalbard and Jan Mayen","ALL - Rest of Latam","Argentina","Belize","Bolivia","Brazil","Costa Rica","Dominican Republic","Ecuador","El Salvador","Falkland Islands (Islas Malvinas)","Guatemala","Honduras","Nicaragua","Panama","Paraguay","Peru","South Georgia and the South Sandwich Islands","Uruguay","Venezuela","ALL - Russia","Russia","ALL - Serbia","Serbia","ALL - South Africa","South Africa","ALL - South East Asia","Bangladesh","Bhutan","British Indian Ocean Territory","Brunei","Cambodia","Fiji Islands","Hong Kong SAR","Indonesia","Korea, North","Korea, South","Laos","Macao SAR","Malaysia","Maldives","Micronesia","Myanmar","Nepal","Palau","Papua New Guinea","Philippines","Pitcairn Islands","Samoa","Singapore","Solomon Islands","Sri Lanka","Taiwan","Thailand","Timor-Leste","Tonga","Vanuatu","Vietnam","Wallis and Futuna","ALL - Sweden2","Sweden","ALL - Switzerland2","Liechtenstein","Switzerland","ALL - Turkey","Turkey","ALL - United Kingdom2","Gibraltar","Saint Helena","United Kingdom","ALL - United States","United States","U.S. Minor Outlying Islands","No of Countries"]
[2,null,"ERP Solution Suite ",null,null,null,null,null,null,null,null,null,null,null,null,null,null,null,null,null,null,null,null,null,null,null,null,null,null,null,null,null,null,null,null,null,null,null,null,null,null,null,null,null,null,null,null,null,null,null,null,null,null,null,null,null,null,null,null,null,null,null,null,null,null,null,null,null,null,null,null,null,null,null,null,null,null,null,null,null,null,null,null,null,null,null,null,null,null,null,null,null,null,null,null,null,null,null,null,null,null,null,null,null,null,null,null,null,null,null,null,null,null,null,null,null,null,null,null,null,null,null,null,null,null,null,null,null,null,null,null,null,null,null,null,null,null,null,null,null,null,null,null,null,null,null,null,null,null,null,null,null,null,null,null,null,null,null,null,null,null,null,null,null,null,null,null,null,null,null,null,null,null,null,null,null,null,null,null,null,null,null,null,null,null,null,null,null,null,null,null,null,null,null,null,null,null,null,null,null,null,null,null,null,null,null,null,null,null,null,null,null,null,null,null,null,null,null,null,null,null,null,null,null,null,null,null,null,null,null,null,null,null,null,null,null,null,null,null,null,null,null,null,null,null,null,null,null,null,null,null,null,null,null,null,null,null,null,null,null,null,null,null,null,null,null,null,null,null,null,null,null,null,null,null,null,null,{"$f":"COUNTIF(G5:JQ5,1)","v":0}]
[3,109098612,"Starter Pack","BRL-AM",null,null,"ALL",1,1,1,1,1,1,1,1,1,1,1,1,1,1,1,1,1,1,1,1,1,1,1,1,1,1,1,1,1,1,1,1,1,1,1,1,1,1,1,1,1,1,1,1,1,1,1,1,1,1,1,1,1,1,1,"ALL",1,1,1,1,"ALL",1,1,1,1,1,1,1,1,"ALL",1,1,"ALL",1,1,1,1,"ALL",1,1,1,1,1,"ALL",1,"ALL",1,"ALL",1,"ALL",1,1,1,"ALL",1,1,1,1,"ALL",1,1,1,1,1,"ALL",1,1,1,1,1,1,1,1,1,1,1,1,1,1,1,1,1,1,1,1,1,1,1,1,1,1,1,1,1,1,1,1,1,1,1,1,"ALL",1,"ALL",1,"ALL",1,1,1,1,1,1,1,1,1,1,1,1,1,1,1,1,1,1,1,1,1,"ALL",1,1,1,1,"ALL",1,"ALL",1,1,1,1,1,1,1,1,1,1,1,1,1,1,"ALL",1,1,1,1,"ALL",1,1,1,"ALL",1,1,1,1,1,1,1,1,1,1,1,1,1,1,1,1,1,1,"ALL",1,"ALL",1,"ALL",1,"ALL",1,1,1,1,1,1,1,1,1,1,1,1,1,1,1,1,1,1,1,1,1,1,1,1,1,1,1,1,1,1,1,1,"ALL",1,"ALL",1,1,"ALL",1,"ALL",1,1,1,"ALL",1,1,240]
[4,109098613,"Extended Pack","BRL-AM",null,null,"ALL",1,1,1,1,1,1,1,1,1,1,1,1,1,1,1,1,1,1,1,1,1,1,1,1,1,1,1,1,1,1,1,1,1,1,1,1,1,1,1,1,1,1,1,1,1,1,1,1,1,1,1,1,1,1,1,"ALL",1,1,1,1,"ALL",1,1,1,1,1,1,1,1,"ALL",1,1,"ALL",1,1,1,1,"ALL",1,1,1,1,1,"ALL",1,"ALL",1,"ALL",1,"ALL",1,1,1,"ALL",1,1,1,1,"ALL",1,1,1,1,1,"ALL",1,1,1,1,1,1,1,1,1,1,1,1,1,1,1,1,1,1,1,1,1,1,1,1,1,1,1,1,1,1,1,1,1,1,1,1,"ALL",1,"ALL",1,"ALL",1,1,1,1,1,1,1,1,1,1,1,1,1,1,1,1,1,1,1,1,1,"ALL",1,1,1,1,"ALL",1,"ALL",1,1,1,1,1,1,1,1,1,1,1,1,1,1,"ALL",1,1,1,1,"ALL",1,1,1,"ALL",1,1,1,1,1,1,1,1,1,1,1,1,1,1,1,1,1,1,"ALL",1,"ALL",1,"ALL",1,"ALL",1,1,1,1,1,1,1,1,1,1,1,1,1,1,1,1,1,1,1,1,1,1,1,1,1,1,1,1,1,1,1,1,"ALL",1,"ALL",1,1,"ALL",1,"ALL",1,1,1,"ALL",1,1,{"$f":"COUNTIF(G7:JQ7,1)","v":240}]
[5,null,"Users",null,null,null,null,null,null,null,null,null,null,null,null,null,null,null,null,null,null,null,null,null,null,null,null,null,null,null,null,null,null,null,null,null,null,null,null,null,null,null,null,null,null,null,null,null,null,null,null,null,null,null,null,null,null,null,null,null,null,null,null,null,null,null,null,null,null,null,null,null,null,null,null,null,null,null,null,null,null,null,null,null,null,null,null,null,null,null,null,null,null,null,null,null,null,null,null,null,null,null,null,null,null,null,null,null,null,null,null,null,null,null,null,null,null,null,null,null,null,null,null,null,null,null,null,null,null,null,null,null,null,null,null,null,null,null,null,null,null,null,null,null,null,null,null,null,null,null,null,null,null,null,null,null,null,null,null,null,null,null,null,null,null,null,null,null,null,null,null,null,null,null,null,null,null,null,null,null,null,null,null,null,null,null,null,null,null,null,null,null,null,null,null,null,null,null,null,null,null,null,null,null,null,null,null,null,null,null,null,null,null,null,null,null,null,null,null,null,null,null,null,null,null,null,null,null,null,null,null,null,null,null,null,null,null,null,null,null,null,null,null,null,null,null,null,null,null,null,null,null,null,null,null,null,null,null,null,null,null,null,null,null,null,null,null,null,null,null,null,null,null,null,null,null,null,0]
[6,109098614,"Full User CAL (Concurrent User)","BRL-AM",null,null,"ALL",1,1,1,1,1,1,1,1,1,1,1,1,1,1,1,1,1,1,1,1,1,1,1,1,1,1,1,1,1,1,1,1,1,1,1,1,1,1,1,1,1,1,1,1,1,1,1,1,1,1,1,1,1,1,1,"ALL",1,1,1,1,"ALL",1,1,1,1,1,1,1,1,"ALL",1,1,"ALL",1,1,1,1,"ALL",1,1,1,1,1,"ALL",1,"ALL",1,"ALL",1,"ALL",1,1,1,"ALL",1,1,1,1,"ALL",1,1,1,1,1,"ALL",1,1,1,1,1,1,1,1,1,1,1,1,1,1,1,1,1,1,1,1,1,1,1,1,1,1,1,1,1,1,1,1,1,1,1,1,"ALL",1,"ALL",1,"ALL",1,1,1,1,1,1,1,1,1,1,1,1,1,1,1,1,1,1,1,1,1,"ALL",1,1,1,1,"ALL",1,"ALL",1,1,1,1,1,1,1,1,1,1,1,1,1,1,"ALL",1,1,1,1,"ALL",1,1,1,"ALL",1,1,1,1,1,1,1,1,1,1,1,1,1,1,1,1,1,1,"ALL",1,"ALL",1,"ALL",1,"ALL",1,1,1,1,1,1,1,1,1,1,1,1,1,1,1,1,1,1,1,1,1,1,1,1,1,1,1,1,1,1,1,1,"ALL",1,"ALL",1,1,"ALL",1,"ALL",1,1,1,"ALL",1,1,{"$f":"COUNTIF(G9:JQ9,1)","v":240}]
[7,109098616,"Limited User CAL (Concurrent User)","BRL-AM",null,null,"ALL",1,1,1,1,1,1,1,1,1,1,1,1,1,1,1,1,1,1,1,1,1,1,1,1,1,1,1,1,1,1,1,1,1,1,1,1,1,1,1,1,1,1,1,1,1,1,1,1,1,1,1,1,1,1,1,"ALL",1,1,1,1,"ALL",1,1,1,1,1,1,1,1,"ALL",1,1,"ALL",1,1,1,1,"ALL",1,1,1,1,1,"ALL",1,"ALL",1,"ALL",1,"ALL",1,1,1,"ALL",1,1,1,1,"ALL",1,1,1,1,1,"ALL",1,1,1,1,1,1,1,1,1,1,1,1,1,1,1,1,1,1,1,1,1,1,1,1,1,1,1,1,1,1,1,1,1,1,1,1,"ALL",1,"ALL",1,"ALL",1,1,1,1,1,1,1,1,1,1,1,1,1,1,1,1,1,1,1,1,1,"ALL",1,1,1,1,"ALL",1,"ALL",1,1,1,1,1,1,1,1,1,1,1,1,1,1,"ALL",1,1,1,1,"ALL",1,1,1,"ALL",1,1,1,1,1,1,1,1,1,1,1,1,1,1,1,1,1,1,"ALL",1,"ALL",1,"ALL",1,"ALL",1,1,1,1,1,1,1,1,1,1,1,1,1,1,1,1,1,1,1,1,1,1,1,1,1,1,1,1,1,1,1,1,"ALL",1,"ALL",1,1,"ALL",1,"ALL",1,1,1,"ALL",1,1,{"$f":"COUNTIF(G10:JQ10,1)","v":240}]
[8,null,"Configuration and Development"]
[9,109099124,"Customization Pack","BRL-AM",null,null,"ALL",1,1,1,1,1,1,1,1,1,1,1,1,1,1,1,1,1,1,1,1,1,1,1,1,1,1,1,1,1,1,1,1,1,1,1,1,1,1,1,1,1,1,1,1,1,1,1,1,1,1,1,1,1,1,1,"ALL",1,1,1,1,"ALL",1,1,1,1,1,1,1,1,"ALL",1,1,"ALL",1,1,1,1,"ALL",1,1,1,1,1,"ALL",1,"ALL",1,"ALL",1,"ALL",1,1,1,"ALL",1,1,1,1,"ALL",1,1,1,1,1,"ALL",1,1,1,1,1,1,1,1,1,1,1,1,1,1,1,1,1,1,1,1,1,1,1,1,1,1,1,1,1,1,1,1,1,1,1,1,"ALL",1,"ALL",1,"ALL",1,1,1,1,1,1,1,1,1,1,1,1,1,1,1,1,1,1,1,1,1,"ALL",1,1,1,1,"ALL",1,"ALL",1,1,1,1,1,1,1,1,1,1,1,1,1,1,"ALL",1,1,1,1,"ALL",1,1,1,"ALL",1,1,1,1,1,1,1,1,1,1,1,1,1,1,1,1,1,1,"ALL",1,"ALL",1,"ALL",1,"ALL",1,1,1,1,1,1,1,1,1,1,1,1,1,1,1,1,1,1,1,1,1,1,1,1,1,1,1,1,1,1,1,1,"ALL",1,"ALL",1,1,"ALL",1,"ALL",1,1,1,"ALL",1,1,240]
[10,null,"Business Intelligence and Reporting"]
[11,109100028,"SmartList Builder","BRL-AM",null,null,"ALL",1,1,1,1,1,1,1,1,1,1,1,1,1,1,1,1,1,1,1,1,1,1,1,1,1,1,1,1,1,1,1,1,1,1,1,1,1,1,1,1,1,1,1,1,1,1,1,1,1,1,1,1,1,1,1,"ALL",1,1,1,1,"ALL",1,1,1,1,1,1,1,1,"ALL",1,1,"ALL",1,1,1,1,"ALL",1,1,1,1,1,"ALL",1,"ALL",1,"ALL",1,"ALL",1,1,1,"ALL",1,1,1,1,"ALL",1,1,1,1,1,"ALL",1,1,1,1,1,1,1,1,1,1,1,1,1,1,1,1,1,1,1,1,1,1,1,1,1,1,1,1,1,1,1,1,1,1,1,1,"ALL",1,"ALL",1,"ALL",1,1,1,1,1,1,1,1,1,1,1,1,1,1,1,1,1,1,1,1,1,"ALL",1,1,1,1,"ALL",1,"ALL",1,1,1,1,1,1,1,1,1,1,1,1,1,1,"ALL",1,1,1,1,"ALL",1,1,1,"ALL",1,1,1,1,1,1,1,1,1,1,1,1,1,1,1,1,1,1,"ALL",1,"ALL",1,"ALL",1,"ALL",1,1,1,1,1,1,1,1,1,1,1,1,1,1,1,1,1,1,1,1,1,1,1,1,1,1,1,1,1,1,1,1,"ALL",1,"ALL",1,1,"ALL",1,"ALL",1,1,1,"ALL",1,1,{"$f":"COUNTIF(G14:JQ14,1)","v":240}]
[12,null,"Human Resource Management"]
[13,109100029,"Extended Human Resources and Payroll ","BRL-AM",null,null,"ALL",1,1,1,1,1,1,1,1,1,1,1,1,1,1,1,1,1,1,1,1,1,1,1,1,1,1,1,1,1,1,1,1,1,1,1,1,1,1,1,1,1,1,1,1,1,1,1,1,1,1,1,1,1,1,1,"ALL",1,1,1,1,"ALL",1,1,1,1,1,1,1,1,"ALL",1,1,"ALL",1,1,1,1,"ALL",1,1,1,1,1,"ALL",1,"ALL",1,"ALL",1,"ALL",1,1,1,"ALL",1,1,1,1,"ALL",1,1,1,1,1,"ALL",1,1,1,1,1,1,1,1,1,1,1,1,1,1,1,1,1,1,1,1,1,1,1,1,1,1,1,1,1,1,1,1,1,1,1,1,"ALL",1,"ALL",1,"ALL",1,1,1,1,1,1,1,1,1,1,1,1,1,1,1,1,1,1,1,1,1,"ALL",1,1,1,1,"ALL",1,"ALL",1,1,1,1,1,1,1,1,1,1,1,1,1,1,"ALL",1,1,1,1,"ALL",1,1,1,"ALL",1,1,1,1,1,1,1,1,1,1,1,1,1,1,1,1,1,1,"ALL",1,"ALL",1,"ALL",1,"ALL",1,1,1,1,1,1,1,1,1,1,1,1,1,1,1,1,1,1,1,1,1,1,1,1,1,1,1,1,1,1,1,1,"ALL",1,"ALL",1,1,"ALL",1,"ALL",1,1,1,"ALL",1,1,{"$f":"COUNTIF(G16:JQ16,1)","v":240}]
[14,null,"Financial Management",null,null,null,null,null,null,null,null,null,null,null,null,null,null,null,null,null,null,null,null,null,null,null,null,null,null,null,null,null,null,null,null,null,null,null,null,null,null,null,null,null,null,null,null,null,null,null,null,null,null,null,null,null,null,null,null,null,null,null,null,null,null,null,null,null,null,null,null,null,null,null,null,null,null,null,null,null,null,null,null,null,null,null,null,null,null,null,null,null,null,null,null,null,null,null,null,null,null,null,null,null,null,null,null,null,null,null,null,null,null,null,null,null,null,null,null,null,null,null,null,null,null,null,null,null,null,null,null,null,null,null,null,null,null,null,null,null,null,null,null,null,null,null,null,null,null,null,null,null,null,null,null,null,null,null,null,null,null,null,null,null,null,null,null,null,null,null,null,null,null,null,null,null,null,null,null,null,null,null,null,null,null,null,null,null,null,null,null,null,null,null,null,null,null,null,null,null,null,null,null,null,null,null,null,null,null,null,null,null,null,null,null,null,null,null,null,null,null,null,null,null,null,null,null,null,null,null,null,null,null,null,null,null,null,null,null,null,null,null,null,null,null,null,null,null,null,null,null,null,null,null,null,null,null,null,null,null,null,null,null,null,null,null,null,null,null,null,null,null,null,null,null,null,null,{"$f":"COUNTIF(G17:JQ17,1)","v":0}]
[15,109100859,"Collections Management","BRL-AM",null,null,"ALL",1,1,1,1,1,1,1,1,1,1,1,1,1,1,1,1,1,1,1,1,1,1,1,1,1,1,1,1,1,1,1,1,1,1,1,1,1,1,1,1,1,1,1,1,1,1,1,1,1,1,1,1,1,1,1,"ALL",1,1,1,1,"ALL",1,1,1,1,1,1,1,1,"ALL",1,1,"ALL",1,1,1,1,"ALL",1,1,1,1,1,"ALL",1,"ALL",1,"ALL",1,"ALL",1,1,1,"ALL",1,1,1,1,"ALL",1,1,1,1,1,"ALL",1,1,1,1,1,1,1,1,1,1,1,1,1,1,1,1,1,1,1,1,1,1,1,1,1,1,1,1,1,1,1,1,1,1,1,1,"ALL",1,"ALL",1,"ALL",1,1,1,1,1,1,1,1,1,1,1,1,1,1,1,1,1,1,1,1,1,"ALL",1,1,1,1,"ALL",1,"ALL",1,1,1,1,1,1,1,1,1,1,1,1,1,1,"ALL",1,1,1,1,"ALL",1,1,1,"ALL",1,1,1,1,1,1,1,1,1,1,1,1,1,1,1,1,1,1,"ALL",1,"ALL",1,"ALL",1,"ALL",1,1,1,1,1,1,1,1,1,1,1,1,1,1,1,1,1,1,1,1,1,1,1,1,1,1,1,1,1,1,1,1,"ALL",1,"ALL",1,1,"ALL",1,"ALL",1,1,1,"ALL",1,1,240]
[16,null,"Database",null,null,null,null,null,null,null,null,null,null,null,null,null,null,null,null,null,null,null,null,null,null,null,null,null,null,null,null,null,null,null,null,null,null,null,null,null,null,null,null,null,null,null,null,null,null,null,null,null,null,null,null,null,null,null,null,null,null,null,null,null,null,null,null,null,null,null,null,null,null,null,null,null,null,null,null,null,null,null,null,null,null,null,null,null,null,null,null,null,null,null,null,null,null,null,null,null,null,null,null,null,null,null,null,null,null,null,null,null,null,null,null,null,null,null,null,null,null,null,null,null,null,null,null,null,null,null,null,null,null,null,null,null,null,null,null,null,null,null,null,null,null,null,null,null,null,null,null,null,null,null,null,null,null,null,null,null,null,null,null,null,null,null,null,null,null,null,null,null,null,null,null,null,null,null,null,null,null,null,null,null,null,null,null,null,null,null,null,null,null,null,null,null,null,null,null,null,null,null,null,null,null,null,null,null,null,null,null,null,null,null,null,null,null,null,null,null,null,null,null,null,null,null,null,null,null,null,null,null,null,null,null,null,null,null,null,null,null,null,null,null,null,null,null,null,null,null,null,null,null,null,null,null,null,null,null,null,null,null,null,null,null,null,null,null,null,null,null,null,null,null,null,null,null,0]
[17,109100653,"98130 Microsoft® SQL Server® 2008 R2  Standard Edition Runtime CAL (All Languages)","BRL-AM",2013,98130,"ALL",1,1,1,1,1,1,1,1,1,1,1,1,1,1,1,1,1,1,1,1,1,1,1,1,1,1,1,1,1,1,1,1,1,1,1,1,1,1,1,1,1,1,1,1,1,1,1,1,1,1,1,1,1,1,1,"ALL",1,1,1,1,"ALL",1,1,1,1,1,1,1,1,"ALL",1,1,"ALL",1,1,1,1,"ALL",1,1,1,1,1,"ALL",1,"ALL",1,"ALL",1,"ALL",1,1,1,"ALL",1,1,1,1,"ALL",1,1,1,1,1,"ALL",1,1,1,1,1,1,1,1,1,1,1,1,1,1,1,1,1,1,1,1,1,1,1,1,1,1,1,1,1,1,1,1,1,1,1,1,"NONE",0,"ALL",1,"ALL",1,1,1,1,1,1,1,1,1,1,1,1,1,1,1,1,1,1,1,1,1,"ALL",1,1,1,1,"ALL",1,"ALL",1,1,1,1,1,1,1,1,1,1,1,1,1,1,"ALL",1,1,1,1,"ALL",1,1,1,"ALL",1,1,1,1,1,1,1,1,1,1,1,1,1,1,1,1,1,1,"ALL",1,"ALL",1,"ALL",1,"ALL",1,1,1,1,1,1,1,1,1,1,1,1,1,1,1,1,1,1,1,1,1,1,1,1,1,1,1,1,1,1,1,1,"ALL",1,"ALL",1,1,"ALL",1,"ALL",1,1,1,"ALL",1,1,239]
[18,109100649,"98160 Microsoft® SQL Server® 2008 R2  Enterprise Edition Runtime CAL (All Languages)","BRL-AM",2013,98160,"ALL",1,1,1,1,1,1,1,1,1,1,1,1,1,1,1,1,1,1,1,1,1,1,1,1,1,1,1,1,1,1,1,1,1,1,1,1,1,1,1,1,1,1,1,1,1,1,1,1,1,1,1,1,1,1,1,"ALL",1,1,1,1,"ALL",1,1,1,1,1,1,1,1,"ALL",1,1,"ALL",1,1,1,1,"ALL",1,1,1,1,1,"ALL",1,"ALL",1,"ALL",1,"ALL",1,1,1,"ALL",1,1,1,1,"ALL",1,1,1,1,1,"ALL",1,1,1,1,1,1,1,1,1,1,1,1,1,1,1,1,1,1,1,1,1,1,1,1,1,1,1,1,1,1,1,1,1,1,1,1,"NONE",0,"ALL",1,"ALL",1,1,1,1,1,1,1,1,1,1,1,1,1,1,1,1,1,1,1,1,1,"ALL",1,1,1,1,"ALL",1,"ALL",1,1,1,1,1,1,1,1,1,1,1,1,1,1,"ALL",1,1,1,1,"ALL",1,1,1,"ALL",1,1,1,1,1,1,1,1,1,1,1,1,1,1,1,1,1,1,"ALL",1,"ALL",1,"ALL",1,"ALL",1,1,1,1,1,1,1,1,1,1,1,1,1,1,1,1,1,1,1,1,1,1,1,1,1,1,1,1,1,1,1,1,"ALL",1,"ALL",1,1,"ALL",1,"ALL",1,1,1,"ALL",1,1,239]
[19,109100655,"98150 Microsoft® SQL Server® 2008 R2  Enterprise Edition Runtime Server License (All Languages)","BRL-AM",2013,98150,"ALL",1,1,1,1,1,1,1,1,1,1,1,1,1,1,1,1,1,1,1,1,1,1,1,1,1,1,1,1,1,1,1,1,1,1,1,1,1,1,1,1,1,1,1,1,1,1,1,1,1,1,1,1,1,1,1,"ALL",1,1,1,1,"ALL",1,1,1,1,1,1,1,1,"ALL",1,1,"ALL",1,1,1,1,"ALL",1,1,1,1,1,"ALL",1,"ALL",1,"ALL",1,"ALL",1,1,1,"ALL",1,1,1,1,"ALL",1,1,1,1,1,"ALL",1,1,1,1,1,1,1,1,1,1,1,1,1,1,1,1,1,1,1,1,1,1,1,1,1,1,1,1,1,1,1,1,1,1,1,1,"NONE",0,"ALL",1,"ALL",1,1,1,1,1,1,1,1,1,1,1,1,1,1,1,1,1,1,1,1,1,"ALL",1,1,1,1,"ALL",1,"ALL",1,1,1,1,1,1,1,1,1,1,1,1,1,1,"ALL",1,1,1,1,"ALL",1,1,1,"ALL",1,1,1,1,1,1,1,1,1,1,1,1,1,1,1,1,1,1,"ALL",1,"ALL",1,"ALL",1,"ALL",1,1,1,1,1,1,1,1,1,1,1,1,1,1,1,1,1,1,1,1,1,1,1,1,1,1,1,1,1,1,1,1,"ALL",1,"ALL",1,1,"ALL",1,"ALL",1,1,1,"ALL",1,1,239]
[20,109100662,"98120 Microsoft® SQL Server® 2008 R2  Standard Edition Runtime Server License (All Languages)","BRL-AM",2013,98120,"ALL",1,1,1,1,1,1,1,1,1,1,1,1,1,1,1,1,1,1,1,1,1,1,1,1,1,1,1,1,1,1,1,1,1,1,1,1,1,1,1,1,1,1,1,1,1,1,1,1,1,1,1,1,1,1,1,"ALL",1,1,1,1,"ALL",1,1,1,1,1,1,1,1,"ALL",1,1,"ALL",1,1,1,1,"ALL",1,1,1,1,1,"ALL",1,"ALL",1,"ALL",1,"ALL",1,1,1,"ALL",1,1,1,1,"ALL",1,1,1,1,1,"ALL",1,1,1,1,1,1,1,1,1,1,1,1,1,1,1,1,1,1,1,1,1,1,1,1,1,1,1,1,1,1,1,1,1,1,1,1,"NONE",0,"ALL",1,"ALL",1,1,1,1,1,1,1,1,1,1,1,1,1,1,1,1,1,1,1,1,1,"ALL",1,1,1,1,"ALL",1,"ALL",1,1,1,1,1,1,1,1,1,1,1,1,1,1,"ALL",1,1,1,1,"ALL",1,1,1,"ALL",1,1,1,1,1,1,1,1,1,1,1,1,1,1,1,1,1,1,"ALL",1,"ALL",1,"ALL",1,"ALL",1,1,1,1,1,1,1,1,1,1,1,1,1,1,1,1,1,1,1,1,1,1,1,1,1,1,1,1,1,1,1,1,"ALL",1,"ALL",1,1,"ALL",1,"ALL",1,1,1,"ALL",1,1,239]
[21,null,"Service Plans",null,null,null,null,null,null,null,null,null,null,null,null,null,null,null,null,null,null,null,null,null,null,null,null,null,null,null,null,null,null,null,null,null,null,null,null,null,null,null,null,null,null,null,null,null,null,null,null,null,null,null,null,null,null,null,null,null,null,null,null,null,null,null,null,null,null,null,null,null,null,null,null,null,null,null,null,null,null,null,null,null,null,null,null,null,null,null,null,null,null,null,null,null,null,null,null,null,null,null,null,null,null,null,null,null,null,null,null,null,null,null,null,null,null,null,null,null,null,null,null,null,null,null,null,null,null,null,null,null,null,null,null,null,null,null,null,null,null,null,null,null,null,null,null,null,null,null,null,null,null,null,null,null,null,null,null,null,null,null,null,null,null,null,null,null,null,null,null,null,null,null,null,null,null,null,null,null,null,null,null,null,null,null,null,null,null,null,null,null,null,null,null,null,null,null,null,null,null,null,null,null,null,null,null,null,null,null,null,null,null,null,null,null,null,null,null,null,null,null,null,null,null,null,null,null,null,null,null,null,null,null,null,null,null,null,null,null,null,null,null,null,null,null,null,null,null,null,null,null,null,null,null,null,null,null,null,null,null,null,null,null,null,null,null,null,null,null,null,null,null,null,null,null,null,{"$f":"COUNTIF(G24:JQ24,1)","v":0}]
[22,null,"Enhancement Plan",null,null,null,"ALL",1,1,1,1,1,1,1,1,1,1,1,1,1,1,1,1,1,1,1,1,1,1,1,1,1,1,1,1,1,1,1,1,1,1,1,1,1,1,1,1,1,1,1,1,1,1,1,1,1,1,1,1,1,1,1,"NONE",0,0,0,0,"ALL",1,1,1,1,1,1,1,1,"NONE",0,0,"ALL",1,1,1,1,"ALL",1,1,1,1,1,"ALL",1,"ALL",1,"ALL",1,"ALL",1,1,1,"ALL",1,1,1,1,"ALL",1,1,1,1,1,"ALL",1,1,1,1,1,1,1,1,1,1,1,1,1,1,1,1,1,1,1,1,1,1,1,1,1,1,1,1,1,1,1,1,1,1,1,1,"ALL",1,"ALL",1,"NONE",0,0,0,0,0,0,0,0,0,0,0,0,0,0,0,0,0,0,0,0,0,"NONE",0,0,0,0,"ALL",1,"ALL",1,1,1,1,1,1,1,1,1,1,1,1,1,1,"ALL",1,1,1,1,"ALL",1,1,1,"ALL",1,1,1,1,1,1,1,1,1,1,1,1,1,1,1,1,1,1,"ALL",1,"ALL",1,"ALL",1,"ALL",1,1,1,1,1,1,1,1,1,1,1,1,1,1,1,1,1,1,1,1,1,1,1,1,1,1,1,1,1,1,1,1,"ALL",1,"ALL",1,1,"ALL",1,"ALL",1,1,1,"NONE",0,0,{"$f":"COUNTIF(G25:JQ25,1)","v":207}]
[23,null,"Three Year Business Ready Enhancement Plan",null,null,null,"ALL",1,1,1,1,1,1,1,1,1,1,1,1,1,1,1,1,1,1,1,1,1,1,1,1,1,1,1,1,1,1,1,1,1,1,1,1,1,1,1,1,1,1,1,1,1,1,1,1,1,1,1,1,1,1,1,"ALL",1,1,1,1,"ALL",1,1,1,1,1,1,1,1,"ALL",1,1,"ALL",1,1,1,1,"ALL",1,1,1,1,1,"ALL",1,"ALL",1,"ALL",1,"ALL",1,1,1,"ALL",1,1,1,1,"ALL",1,1,1,1,1,"ALL",1,1,1,1,1,1,1,1,1,1,1,1,1,1,1,1,1,1,1,1,1,1,1,1,1,1,1,1,1,1,1,1,1,1,1,1,"ALL",1,"ALL",1,"ALL",1,1,1,1,1,1,1,1,1,1,1,1,1,1,1,1,1,1,1,1,1,"ALL",1,1,1,1,"ALL",1,"ALL",1,1,1,1,1,1,1,1,1,1,1,1,1,1,"ALL",1,1,1,1,"ALL",1,1,1,"ALL",1,1,1,1,1,1,1,1,1,1,1,1,1,1,1,1,1,1,"ALL",1,"ALL",1,"ALL",1,"ALL",1,1,1,1,1,1,1,1,1,1,1,1,1,1,1,1,1,1,1,1,1,1,1,1,1,1,1,1,1,1,1,1,"ALL",1,"ALL",1,1,"ALL",1,"ALL",1,1,1,"ALL",1,1,{"$f":"COUNTIF(G26:JQ26,1)","v":240}]
[24,"","Business Ready Enhancement Plus Plan (LATAM)",null,null,null,"NONE",0,0,0,0,0,0,0,0,0,0,0,0,0,0,0,0,0,0,0,0,0,0,0,0,0,0,0,0,0,0,0,0,0,0,0,0,0,0,0,0,0,0,0,0,0,0,0,0,0,0,0,0,0,0,0,"NONE",0,0,0,0,"NONE",0,0,0,0,0,0,0,0,"NONE",0,0,"NONE",0,0,0,0,"NONE",0,0,0,0,0,"ALL",1,"NONE",0,"ALL",1,"NONE",0,0,0,"NONE",0,0,0,0,"NONE",0,0,0,0,0,"NONE",0,0,0,0,0,0,0,0,0,0,0,0,0,0,0,0,0,0,0,0,0,0,0,0,0,0,0,0,0,0,0,0,0,0,0,0,"NONE",0,"NONE",0,"NONE",0,0,0,0,0,0,0,0,0,0,0,0,0,0,0,0,0,0,0,0,0,"NONE",0,0,0,0,"ALL",1,"NONE",0,0,0,0,0,0,0,0,0,0,0,0,0,0,"NONE",0,0,0,0,"NONE",0,0,0,"ALL",1,1,1,1,1,1,1,1,1,1,1,1,1,1,1,1,1,1,"NONE",0,"NONE",0,"NONE",0,"NONE",0,0,0,0,0,0,0,0,0,0,0,0,0,0,0,0,0,0,0,0,0,0,0,0,0,0,0,0,0,0,0,0,"NONE",0,"NONE",0,0,"NONE",0,"NONE",0,0,0,"NONE",0,0,{"$f":"COUNTIF(G27:JQ27,1)","v":21}]
[25,"","Business Ready Advantage Plan",null,null,null,"NONE",0,0,0,0,0,0,0,0,0,0,0,0,0,0,0,0,0,0,0,0,0,0,0,0,0,0,0,0,0,0,0,0,0,0,0,0,0,0,0,0,0,0,0,0,0,0,0,0,0,0,0,0,0,0,0,"ALL",1,1,1,1,"ALL",0,0,0,0,0,0,0,0,"ALL",1,1,"NONE",0,0,0,0,"NONE",0,0,0,0,0,"NONE",0,"NONE",0,"NONE",0,"NONE",0,0,0,"NONE",0,0,0,0,"NONE",0,0,0,0,0,"NONE",0,0,0,0,0,0,0,0,0,0,0,0,0,0,0,0,0,0,0,0,0,0,0,0,0,0,0,0,0,0,0,0,0,0,0,0,"NONE",0,"NONE",0,"ALL",1,1,1,1,1,1,1,1,1,1,1,1,1,1,1,1,1,1,1,1,1,"ALL",1,1,1,1,"NONE",0,"NONE",0,0,0,0,0,0,0,0,0,0,0,0,0,0,"NONE",0,0,0,0,"NONE",0,0,0,"NONE",0,0,0,0,0,0,0,0,0,0,0,0,0,0,0,0,0,0,"NONE",0,"NONE",0,"NONE",0,"NONE",0,0,0,0,0,0,0,0,0,0,0,0,0,0,0,0,0,0,0,0,0,0,0,0,0,0,0,0,0,0,0,0,"NONE",0,"NONE",0,0,"NONE",0,"NONE",0,0,0,"ALL",1,1,{"$f":"COUNTIF(G28:JQ28,1)","v":33}]
[26,null,"Three Year Business Ready Advantage Plan",null,null,null,"NONE",0,0,0,0,0,0,0,0,0,0,0,0,0,0,0,0,0,0,0,0,0,0,0,0,0,0,0,0,0,0,0,0,0,0,0,0,0,0,0,0,0,0,0,0,0,0,0,0,0,0,0,0,0,0,0,"NONE",0,0,0,0,"NONE",0,0,0,0,0,0,0,0,"ALL",1,1,"NONE",0,0,0,0,"NONE",0,0,0,0,0,"NONE",0,"NONE",0,"NONE",0,"NONE",0,0,0,"NONE",0,0,0,0,"NONE",0,0,0,0,0,"NONE",0,0,0,0,0,0,0,0,0,0,0,0,0,0,0,0,0,0,0,0,0,0,0,0,0,0,0,0,0,0,0,0,0,0,0,0,"NONE",0,"NONE",0,"ALL",1,1,1,1,1,1,1,1,1,1,1,1,1,1,1,1,1,1,1,1,1,"NONE",0,0,0,0,"NONE",0,"NONE",0,0,0,0,0,0,0,0,0,0,0,0,0,0,"NONE",0,0,0,0,"NONE",0,0,0,"NONE",0,0,0,0,0,0,0,0,0,0,0,0,0,0,0,0,0,0,"NONE",0,"NONE",0,"NONE",0,"NONE",0,0,0,0,0,0,0,0,0,0,0,0,0,0,0,0,0,0,0,0,0,0,0,0,0,0,0,0,0,0,0,0,"NONE",0,"NONE",0,0,"NONE",0,"NONE",0,0,0,"ALL",1,1,{"$f":"COUNTIF(G29:JQ29,1)","v":25}]
[27,null,"Business Ready Advantage Plus Plan",null,null,null,"NONE",0,0,0,0,0,0,0,0,0,0,0,0,0,0,0,0,0,0,0,0,0,0,0,0,0,0,0,0,0,0,0,0,0,0,0,0,0,0,0,0,0,0,0,0,0,0,0,0,0,0,0,0,0,0,0,"ALL",1,1,1,1,"ALL",0,0,0,0,0,0,0,0,"ALL",1,1,"NONE",0,0,0,0,"NONE",0,0,0,0,0,"NONE",0,"NONE",0,"NONE",0,"NONE",0,0,0,"NONE",0,0,0,0,"NONE",0,0,0,0,0,"NONE",0,0,0,0,0,0,0,0,0,0,0,0,0,0,0,0,0,0,0,0,0,0,0,0,0,0,0,0,0,0,0,0,0,0,0,0,"NONE",0,"NONE",0,"ALL",1,1,1,1,1,1,1,1,1,1,1,1,1,1,1,1,1,1,1,1,1,"ALL",1,1,1,1,"NONE",0,"NONE",0,0,0,0,0,0,0,0,0,0,0,0,0,0,"NONE",0,0,0,0,"NONE",0,0,0,"NONE",0,0,0,0,0,0,0,0,0,0,0,0,0,0,0,0,0,0,"NONE",0,"NONE",0,"NONE",0,"NONE",0,0,0,0,0,0,0,0,0,0,0,0,0,0,0,0,0,0,0,0,0,0,0,0,0,0,0,0,0,0,0,0,"NONE",0,"NONE",0,0,"NONE",0,"NONE",0,0,0,"ALL",1,1,33]
[28,null,"Business Ready Advantage Plus Plan (LATAM)",null,null,null,"NONE",0,0,0,0,0,0,0,0,0,0,0,0,0,0,0,0,0,0,0,0,0,0,0,0,0,0,0,0,0,0,0,0,0,0,0,0,0,0,0,0,0,0,0,0,0,0,0,0,0,0,0,0,0,0,0,"NONE",0,0,0,0,"NONE",0,0,0,0,0,0,0,0,"NONE",0,0,"NONE",0,0,0,0,"NONE",0,0,0,0,0,"ALL",1,"NONE",0,"ALL",1,"NONE",0,0,0,"NONE",0,0,0,0,"NONE",0,0,0,0,0,"NONE",0,0,0,0,0,0,0,0,0,0,0,0,0,0,0,0,0,0,0,0,0,0,0,0,0,0,0,0,0,0,0,0,0,0,0,0,"NONE",0,"NONE",0,"NONE",0,0,0,0,0,0,0,0,0,0,0,0,0,0,0,0,0,0,0,0,0,"NONE",0,0,0,0,"ALL",1,"NONE",0,0,0,0,0,0,0,0,0,0,0,0,0,0,"NONE",0,0,0,0,"NONE",0,0,0,"ALL",1,1,1,1,1,1,1,1,1,1,1,1,1,1,1,1,1,1,"NONE",0,"NONE",0,"NONE",0,"NONE",0,0,0,0,0,0,0,0,0,0,0,0,0,0,0,0,0,0,0,0,0,0,0,0,0,0,0,0,0,0,0,0,"NONE",0,"NONE",0,0,"NONE",0,"NONE",0,0,0,"NONE",0,0,21]

{"sheet":"Geography","index":11,"n_rows":245,"n_cols":31,"rows_kept":245,"cut":false,"hidden":true,"merged":[[1,1,1,8],[1,10,1,14],[1,16,1,18],[1,20,1,23],[1,25,1,26]]}
[]
[null,"COUNTRY LIST",null,null,null,null,null,null,null,null,"PRICE REGION LIST",null,null,null,null,null,"EXCLUDED (NO SALE) COUNTRY LIST",null,null,null,"CURRENCYLIST",null,null,null,null,"CountryCode List (NAV ONLY)"]
["KPI",null,null,null,null,null,{"$f":"COUNTIF(Table1[Excluded Country],TRUE)","v":7},{"$f":"COUNTIF(Table1[EEAS],TRUE)","v":48},{"$f":"COUNTIF(Table1[GroupA],TRUE)","v":12},null,{"$f":"COUNTA(Table2[Price Region])","v":31},null,null,null,null,null,{"$f":"COUNTA(Table3[Excluded Countries])","v":7},null,null,null,{"$f":"COUNTA(Table4[CurrencyName])","v":14}]
["Lookup",1,2,null,3,4,5,6,7,null,null,1,2,4,5,null,null,1,2,null,null,1,2]
[null,"Country Name","Country Code","Price Region","Price Region Code ","Currency","Excluded Country","EEAS","GroupA",null,"Price Region","Price region Code","Currency","EEAS","Group A",null,"Excluded Countries","CountryCode","Message",null,"CurrencyCode","CurrencyName","Per USD","Per EUR",null,"Country Version","Ccode "]
[null,"Afghanistan",1,"Central Asia 1 - CEE 1",{"$f":"VLOOKUP(Table1[[#This Row],[Price Region]],PRICEREGIONLIST,2,FALSE)","v":5},{"$f":"VLOOKUP(Table1[[#This Row],[Price Region]],PRICEREGIONLIST,3,FALSE)","v":"USD"},{"$f":"IFERROR(VLOOKUP(Table1[[#This Row],[Country Name]],EXCOUNTRYLIST,1,FALSE)<>\"N/A\",\"FALSE\")","v":"FALSE"},{"$f":"VLOOKUP(Table1[[#This Row],[Price Region]],PRICEREGIONLIST,4,FALSE)","v":false},{"$f":"VLOOKUP(Table1[[#This Row],[Price Region]],PRICEREGIONLIST,5,FALSE)","v":false},null,"Africa","1","USD",false,false,null,"Iran",{"$f":"VLOOKUP(Table3[[#This Row],[Excluded Countries]],COUNTRYLIST,2,FALSE)","v":101},{"$f":"CONCATENATE(\"Please contact your Regional Operations Center (ROC) for \", Q6, \" pricing information.\")","v":"Please contact your Regional Operations Center (ROC) for Iran pricing information."},null,"AUD","Australian Dollar",null,"-",null,"Argentina",1]
[null,"Albania",2,"Eastern Europe 1",{"$f":"VLOOKUP(Table1[[#This Row],[Price Region]],PRICEREGIONLIST,2,FALSE)","v":10},{"$f":"VLOOKUP(Table1[[#This Row],[Price Region]],PRICEREGIONLIST,3,FALSE)","v":"USD"},{"$f":"IFERROR(VLOOKUP(Table1[[#This Row],[Country Name]],EXCOUNTRYLIST,1,FALSE)<>\"N/A\",\"FALSE\")","v":"FALSE"},{"$f":"VLOOKUP(Table1[[#This Row],[Price Region]],PRICEREGIONLIST,4,FALSE)","v":false},{"$f":"VLOOKUP(Table1[[#This Row],[Price Region]],PRICEREGIONLIST,5,FALSE)","v":false},null,"APOC United States",{"$f":"L6+1","v":2},"USD",false,false,null,"Korea, North",{"$f":"VLOOKUP(Table3[[#This Row],[Excluded Countries]],COUNTRYLIST,2,FALSE)","v":112},"Please contact your Regional Operations Center (ROC) for Korea, North pricing information.",null,"CAD","Canadian Dollar",null,"-",null,"Australia",{"$f":"AA6+1","v":2}]
[null,"Algeria",3,"Africa",{"$f":"VLOOKUP(Table1[[#This Row],[Price Region]],PRICEREGIONLIST,2,FALSE)","v":"1"},{"$f":"VLOOKUP(Table1[[#This Row],[Price Region]],PRICEREGIONLIST,3,FALSE)","v":"USD"},{"$f":"IFERROR(VLOOKUP(Table1[[#This Row],[Country Name]],EXCOUNTRYLIST,1,FALSE)<>\"N/A\",\"FALSE\")","v":"FALSE"},{"$f":"VLOOKUP(Table1[[#This Row],[Price Region]],PRICEREGIONLIST,4,FALSE)","v":false},{"$f":"VLOOKUP(Table1[[#This Row],[Price Region]],PRICEREGIONLIST,5,FALSE)","v":false},null,"Australia",3,"AUD",false,false,null,"Sudan",{"$f":"VLOOKUP(Table3[[#This Row],[Excluded Countries]],COUNTRYLIST,2,FALSE)","v":201},"Please contact your Regional Operations Center (ROC) for Sudan pricing information.",null,"CHF","Swiss Franc",1.292,{"$f":"Table4[[#This Row],[Per USD]]/W10","v":1.2068055196859653},null,"Austria",3]
[null,"American Samoa",4,"APOC United States",{"$f":"VLOOKUP(Table1[[#This Row],[Price Region]],PRICEREGIONLIST,2,FALSE)","v":2},{"$f":"VLOOKUP(Table1[[#This Row],[Price Region]],PRICEREGIONLIST,3,FALSE)","v":"USD"},{"$f":"IFERROR(VLOOKUP(Table1[[#This Row],[Country Name]],EXCOUNTRYLIST,1,FALSE)<>\"N/A\",\"FALSE\")","v":"FALSE"},{"$f":"VLOOKUP(Table1[[#This Row],[Price Region]],PRICEREGIONLIST,4,FALSE)","v":false},{"$f":"VLOOKUP(Table1[[#This Row],[Price Region]],PRICEREGIONLIST,5,FALSE)","v":false},null,"Canada",4,"CAD",false,false,null,"Syria",{"$f":"VLOOKUP(Table3[[#This Row],[Excluded Countries]],COUNTRYLIST,2,FALSE)","v":207},"Please contact your Regional Operations Center (ROC) for Syria pricing information.",null,"DKK","Danish Krone",7.9700326769999998,{"$f":"Table4[[#This Row],[Per USD]]/W10","v":7.4444887203414156},null,"Belgium",4]
[null,"Andorra",5,"Eurozone",{"$f":"VLOOKUP(Table1[[#This Row],[Price Region]],PRICEREGIONLIST,2,FALSE)","v":26},{"$f":"VLOOKUP(Table1[[#This Row],[Price Region]],PRICEREGIONLIST,3,FALSE)","v":"EUR"},{"$f":"IFERROR(VLOOKUP(Table1[[#This Row],[Country Name]],EXCOUNTRYLIST,1,FALSE)<>\"N/A\",\"FALSE\")","v":"FALSE"},{"$f":"VLOOKUP(Table1[[#This Row],[Price Region]],PRICEREGIONLIST,4,FALSE)","v":true},{"$f":"VLOOKUP(Table1[[#This Row],[Price Region]],PRICEREGIONLIST,5,FALSE)","v":false},null,"Central Asia 1 - CEE 1",5,"USD",false,false,null,"Cuba",{"$f":"VLOOKUP(Table3[[#This Row],[Excluded Countries]],COUNTRYLIST,2,FALSE)","v":55},"Please contact your Regional Operations Center (ROC) for Cuba pricing information.",null,"EUR","Euro",1.0705950369999999,{"$f":"Table4[[#This Row],[Per USD]]/Table4[[#This Row],[Per USD]]","v":1},null,"Brazil",5]
[null,"Angola",6,"Africa",{"$f":"VLOOKUP(Table1[[#This Row],[Price Region]],PRICEREGIONLIST,2,FALSE)","v":"1"},{"$f":"VLOOKUP(Table1[[#This Row],[Price Region]],PRICEREGIONLIST,3,FALSE)","v":"USD"},{"$f":"IFERROR(VLOOKUP(Table1[[#This Row],[Country Name]],EXCOUNTRYLIST,1,FALSE)<>\"N/A\",\"FALSE\")","v":"FALSE"},{"$f":"VLOOKUP(Table1[[#This Row],[Price Region]],PRICEREGIONLIST,4,FALSE)","v":false},{"$f":"VLOOKUP(Table1[[#This Row],[Price Region]],PRICEREGIONLIST,5,FALSE)","v":false},null,"Central Asia 2 - CEE 2",6,"USD",false,false,null,null,null,null,null,"GBP","Pounds Sterling",0.84482292511489587,{"$f":"Table4[[#This Row],[Per USD]]/W10","v":0.78911530122747608},null,"Bulgaria",6,null,"China",{"$f":"VLOOKUP(Table3[[#This Row],[Excluded Countries]],COUNTRYLIST,2,FALSE)","v":{"$error":"#N/A"}},{"$f":"CONCATENATE(\"Please contact your Regional Operations Center (ROC) for \", AC11, \" pricing information.\")","v":"Please contact your Regional Operations Center (ROC) for China pricing information."}]
[null,"Anguilla",7,"Latam Caribbean",{"$f":"VLOOKUP(Table1[[#This Row],[Price Region]],PRICEREGIONLIST,2,FALSE)","v":14},{"$f":"VLOOKUP(Table1[[#This Row],[Price Region]],PRICEREGIONLIST,3,FALSE)","v":"USD"},{"$f":"IFERROR(VLOOKUP(Table1[[#This Row],[Country Name]],EXCOUNTRYLIST,1,FALSE)<>\"N/A\",\"FALSE\")","v":"FALSE"},{"$f":"VLOOKUP(Table1[[#This Row],[Price Region]],PRICEREGIONLIST,4,FALSE)","v":false},{"$f":"VLOOKUP(Table1[[#This Row],[Price Region]],PRICEREGIONLIST,5,FALSE)","v":false},null,"Chile",7,"USD",false,false,null,null,null,null,null,"INR","Indian Rupee",null,"-",null,"Canada",7,null,"Japan",{"$f":"VLOOKUP(Table3[[#This Row],[Excluded Countries]],COUNTRYLIST,2,FALSE)","v":{"$error":"#N/A"}},{"$f":"CONCATENATE(\"Please contact your Regional Operations Center (ROC) for \", AC12, \" pricing information.\")","v":"Please contact your Regional Operations Center (ROC) for Japan pricing information."}]
[null,"Antarctica",8,"Latam Caribbean",{"$f":"VLOOKUP(Table1[[#This Row],[Price Region]],PRICEREGIONLIST,2,FALSE)","v":14},{"$f":"VLOOKUP(Table1[[#This Row],[Price Region]],PRICEREGIONLIST,3,FALSE)","v":"USD"},{"$f":"IFERROR(VLOOKUP(Table1[[#This Row],[Country Name]],EXCOUNTRYLIST,1,FALSE)<>\"N/A\",\"FALSE\")","v":"FALSE"},{"$f":"VLOOKUP(Table1[[#This Row],[Price Region]],PRICEREGIONLIST,4,FALSE)","v":false},{"$f":"VLOOKUP(Table1[[#This Row],[Price Region]],PRICEREGIONLIST,5,FALSE)","v":false},null,"China",8,"RMB",false,false,null,"Brazil",{"$f":"VLOOKUP(Table3[[#This Row],[Excluded Countries]],COUNTRYLIST,2,FALSE)","v":30},{"$f":"CONCATENATE(\"Please contact your Regional Operations Center (ROC) for \", Q13, \" pricing information.\")","v":"Please contact your Regional Operations Center (ROC) for Brazil pricing information."},null,"JPY","Japanese Yen",null,"-",null,"Croatia",8]
[null,"Antigua and Barbuda",9,"Latam Caribbean",{"$f":"VLOOKUP(Table1[[#This Row],[Price Region]],PRICEREGIONLIST,2,FALSE)","v":14},{"$f":"VLOOKUP(Table1[[#This Row],[Price Region]],PRICEREGIONLIST,3,FALSE)","v":"USD"},{"$f":"IFERROR(VLOOKUP(Table1[[#This Row],[Country Name]],EXCOUNTRYLIST,1,FALSE)<>\"N/A\",\"FALSE\")","v":"FALSE"},{"$f":"VLOOKUP(Table1[[#This Row],[Price Region]],PRICEREGIONLIST,4,FALSE)","v":false},{"$f":"VLOOKUP(Table1[[#This Row],[Price Region]],PRICEREGIONLIST,5,FALSE)","v":false},null,"Colombia",9,"USD",false,false,null,"Poland",{"$f":"VLOOKUP(Table3[[#This Row],[Excluded Countries]],COUNTRYLIST,2,FALSE)","v":171},{"$f":"CONCATENATE(\"Please contact your Regional Operations Center (ROC) for \", Q14, \" pricing information.\")","v":"Please contact your Regional Operations Center (ROC) for Poland pricing information."},null,"NOK","Norwegian Krona",8.2805999999999997,{"$f":"Table4[[#This Row],[Per USD]]/W10","v":7.7345772339873085},null,"Cyprus",9]
[null,"Argentina",10,"Rest of Latam",{"$f":"VLOOKUP(Table1[[#This Row],[Price Region]],PRICEREGIONLIST,2,FALSE)","v":19},{"$f":"VLOOKUP(Table1[[#This Row],[Price Region]],PRICEREGIONLIST,3,FALSE)","v":"USD"},{"$f":"IFERROR(VLOOKUP(Table1[[#This Row],[Country Name]],EXCOUNTRYLIST,1,FALSE)<>\"N/A\",\"FALSE\")","v":"FALSE"},{"$f":"VLOOKUP(Table1[[#This Row],[Price Region]],PRICEREGIONLIST,4,FALSE)","v":false},{"$f":"VLOOKUP(Table1[[#This Row],[Price Region]],PRICEREGIONLIST,5,FALSE)","v":false},null,"Denmark2",27,"DKK",true,true,null,null,null,null,null,"NZD","New Zealand Dollar",null,"-",null,"Czech Republic",10]
[null,"Armenia",11,"Eastern Europe 2",{"$f":"VLOOKUP(Table1[[#This Row],[Price Region]],PRICEREGIONLIST,2,FALSE)","v":11},{"$f":"VLOOKUP(Table1[[#This Row],[Price Region]],PRICEREGIONLIST,3,FALSE)","v":"USD"},{"$f":"IFERROR(VLOOKUP(Table1[[#This Row],[Country Name]],EXCOUNTRYLIST,1,FALSE)<>\"N/A\",\"FALSE\")","v":"FALSE"},{"$f":"VLOOKUP(Table1[[#This Row],[Price Region]],PRICEREGIONLIST,4,FALSE)","v":false},{"$f":"VLOOKUP(Table1[[#This Row],[Price Region]],PRICEREGIONLIST,5,FALSE)","v":false},null,"Eastern Europe 1",10,"USD",false,false,null,null,null,null,null,"RMB","Chinese Renminbi",null,"-",null,"Denmark",11]
[null,"Aruba",12,"Latam Caribbean",{"$f":"VLOOKUP(Table1[[#This Row],[Price Region]],PRICEREGIONLIST,2,FALSE)","v":14},{"$f":"VLOOKUP(Table1[[#This Row],[Price Region]],PRICEREGIONLIST,3,FALSE)","v":"USD"},{"$f":"IFERROR(VLOOKUP(Table1[[#This Row],[Country Name]],EXCOUNTRYLIST,1,FALSE)<>\"N/A\",\"FALSE\")","v":"FALSE"},{"$f":"VLOOKUP(Table1[[#This Row],[Price Region]],PRICEREGIONLIST,4,FALSE)","v":false},{"$f":"VLOOKUP(Table1[[#This Row],[Price Region]],PRICEREGIONLIST,5,FALSE)","v":false},null,"Eastern Europe 2",11,"USD",false,false,null,null,null,null,null,"RUB","Russian Ruble",null,"-",null,"Estonia",12]
[null,"Australia",13,"Australia",{"$f":"VLOOKUP(Table1[[#This Row],[Price Region]],PRICEREGIONLIST,2,FALSE)","v":3},{"$f":"VLOOKUP(Table1[[#This Row],[Price Region]],PRICEREGIONLIST,3,FALSE)","v":"AUD"},{"$f":"IFERROR(VLOOKUP(Table1[[#This Row],[Country Name]],EXCOUNTRYLIST,1,FALSE)<>\"N/A\",\"FALSE\")","v":"FALSE"},{"$f":"VLOOKUP(Table1[[#This Row],[Price Region]],PRICEREGIONLIST,4,FALSE)","v":false},{"$f":"VLOOKUP(Table1[[#This Row],[Price Region]],PRICEREGIONLIST,5,FALSE)","v":false},null,"Eurozone",26,"EUR",true,false,null,null,null,null,null,"SEK","Swedish Krowne",9.793253537,{"$f":"Table4[[#This Row],[Per USD]]/W10","v":9.1474863963898621},null,"Finland",13]
[null,"Austria",14,"Eurozone",{"$f":"VLOOKUP(Table1[[#This Row],[Price Region]],PRICEREGIONLIST,2,FALSE)","v":26},{"$f":"VLOOKUP(Table1[[#This Row],[Price Region]],PRICEREGIONLIST,3,FALSE)","v":"EUR"},{"$f":"IFERROR(VLOOKUP(Table1[[#This Row],[Country Name]],EXCOUNTRYLIST,1,FALSE)<>\"N/A\",\"FALSE\")","v":"FALSE"},{"$f":"VLOOKUP(Table1[[#This Row],[Price Region]],PRICEREGIONLIST,4,FALSE)","v":true},{"$f":"VLOOKUP(Table1[[#This Row],[Price Region]],PRICEREGIONLIST,5,FALSE)","v":false},null,"India",12,"INR",false,false,null,null,null,null,null,"USD","US Dollar",null,"-",null,"France",14]
[null,"Azerbaijan",15,"Central Asia 2 - CEE 2",{"$f":"VLOOKUP(Table1[[#This Row],[Price Region]],PRICEREGIONLIST,2,FALSE)","v":6},{"$f":"VLOOKUP(Table1[[#This Row],[Price Region]],PRICEREGIONLIST,3,FALSE)","v":"USD"},{"$f":"IFERROR(VLOOKUP(Table1[[#This Row],[Country Name]],EXCOUNTRYLIST,1,FALSE)<>\"N/A\",\"FALSE\")","v":"FALSE"},{"$f":"VLOOKUP(Table1[[#This Row],[Price Region]],PRICEREGIONLIST,4,FALSE)","v":false},{"$f":"VLOOKUP(Table1[[#This Row],[Price Region]],PRICEREGIONLIST,5,FALSE)","v":false},null,"Japan",13,"JPY",false,false,null,null,null,null,null,null,null,null,null,null,"Germany",15]
[null,"Bahamas, The",16,"Latam Caribbean",{"$f":"VLOOKUP(Table1[[#This Row],[Price Region]],PRICEREGIONLIST,2,FALSE)","v":14},{"$f":"VLOOKUP(Table1[[#This Row],[Price Region]],PRICEREGIONLIST,3,FALSE)","v":"USD"},{"$f":"IFERROR(VLOOKUP(Table1[[#This Row],[Country Name]],EXCOUNTRYLIST,1,FALSE)<>\"N/A\",\"FALSE\")","v":"FALSE"},{"$f":"VLOOKUP(Table1[[#This Row],[Price Region]],PRICEREGIONLIST,4,FALSE)","v":false},{"$f":"VLOOKUP(Table1[[#This Row],[Price Region]],PRICEREGIONLIST,5,FALSE)","v":false},null,"Latam Caribbean",14,"USD",false,false,null,null,null,null,null,null,null,null,null,null,"Great Britain",16]
[null,"Bahrain",17,"Middle East",{"$f":"VLOOKUP(Table1[[#This Row],[Price Region]],PRICEREGIONLIST,2,FALSE)","v":17},{"$f":"VLOOKUP(Table1[[#This Row],[Price Region]],PRICEREGIONLIST,3,FALSE)","v":"USD"},{"$f":"IFERROR(VLOOKUP(Table1[[#This Row],[Country Name]],EXCOUNTRYLIST,1,FALSE)<>\"N/A\",\"FALSE\")","v":"FALSE"},{"$f":"VLOOKUP(Table1[[#This Row],[Price Region]],PRICEREGIONLIST,4,FALSE)","v":false},{"$f":"VLOOKUP(Table1[[#This Row],[Price Region]],PRICEREGIONLIST,5,FALSE)","v":false},null,"Latam PR/BM/CI/VI",15,"USD",false,false,null,null,null,null,null,null,null,null,null,null,"Greece",17]
[null,"Bangladesh",18,"South East Asia",{"$f":"VLOOKUP(Table1[[#This Row],[Price Region]],PRICEREGIONLIST,2,FALSE)","v":23},{"$f":"VLOOKUP(Table1[[#This Row],[Price Region]],PRICEREGIONLIST,3,FALSE)","v":"USD"},{"$f":"IFERROR(VLOOKUP(Table1[[#This Row],[Country Name]],EXCOUNTRYLIST,1,FALSE)<>\"N/A\",\"FALSE\")","v":"FALSE"},{"$f":"VLOOKUP(Table1[[#This Row],[Price Region]],PRICEREGIONLIST,4,FALSE)","v":false},{"$f":"VLOOKUP(Table1[[#This Row],[Price Region]],PRICEREGIONLIST,5,FALSE)","v":false},null,"Mexico",16,"USD",false,false,null,null,null,null,null,null,null,null,null,null,"Hungary",18]
[null,"Barbados",19,"Latam Caribbean",{"$f":"VLOOKUP(Table1[[#This Row],[Price Region]],PRICEREGIONLIST,2,FALSE)","v":14},{"$f":"VLOOKUP(Table1[[#This Row],[Price Region]],PRICEREGIONLIST,3,FALSE)","v":"USD"},{"$f":"IFERROR(VLOOKUP(Table1[[#This Row],[Country Name]],EXCOUNTRYLIST,1,FALSE)<>\"N/A\",\"FALSE\")","v":"FALSE"},{"$f":"VLOOKUP(Table1[[#This Row],[Price Region]],PRICEREGIONLIST,4,FALSE)","v":false},{"$f":"VLOOKUP(Table1[[#This Row],[Price Region]],PRICEREGIONLIST,5,FALSE)","v":false},null,"Middle East",17,"USD",false,false,null,null,null,null,null,null,null,null,null,null,"Iceland",19]
[null,"Belarus",20,"Eastern Europe 2",{"$f":"VLOOKUP(Table1[[#This Row],[Price Region]],PRICEREGIONLIST,2,FALSE)","v":11},{"$f":"VLOOKUP(Table1[[#This Row],[Price Region]],PRICEREGIONLIST,3,FALSE)","v":"USD"},{"$f":"IFERROR(VLOOKUP(Table1[[#This Row],[Country Name]],EXCOUNTRYLIST,1,FALSE)<>\"N/A\",\"FALSE\")","v":"FALSE"},{"$f":"VLOOKUP(Table1[[#This Row],[Price Region]],PRICEREGIONLIST,4,FALSE)","v":false},{"$f":"VLOOKUP(Table1[[#This Row],[Price Region]],PRICEREGIONLIST,5,FALSE)","v":false},null,"New Zealand",18,"NZD",false,false,null,null,null,null,null,null,null,null,null,null,"India",20]
[null,"Belgium",21,"Eurozone",{"$f":"VLOOKUP(Table1[[#This Row],[Price Region]],PRICEREGIONLIST,2,FALSE)","v":26},{"$f":"VLOOKUP(Table1[[#This Row],[Price Region]],PRICEREGIONLIST,3,FALSE)","v":"EUR"},{"$f":"IFERROR(VLOOKUP(Table1[[#This Row],[Country Name]],EXCOUNTRYLIST,1,FALSE)<>\"N/A\",\"FALSE\")","v":"FALSE"},{"$f":"VLOOKUP(Table1[[#This Row],[Price Region]],PRICEREGIONLIST,4,FALSE)","v":true},{"$f":"VLOOKUP(Table1[[#This Row],[Price Region]],PRICEREGIONLIST,5,FALSE)","v":false},null,"Norway2",28,"NOK",true,true,null,null,null,null,null,null,null,null,null,null,"Indonesia",21]
[null,"Belize",22,"Rest of Latam",{"$f":"VLOOKUP(Table1[[#This Row],[Price Region]],PRICEREGIONLIST,2,FALSE)","v":19},{"$f":"VLOOKUP(Table1[[#This Row],[Price Region]],PRICEREGIONLIST,3,FALSE)","v":"USD"},{"$f":"IFERROR(VLOOKUP(Table1[[#This Row],[Country Name]],EXCOUNTRYLIST,1,FALSE)<>\"N/A\",\"FALSE\")","v":"FALSE"},{"$f":"VLOOKUP(Table1[[#This Row],[Price Region]],PRICEREGIONLIST,4,FALSE)","v":false},{"$f":"VLOOKUP(Table1[[#This Row],[Price Region]],PRICEREGIONLIST,5,FALSE)","v":false},null,"Rest of Latam",19,"USD",false,false,null,null,null,null,null,null,null,null,null,null,"Ireland",22]
[null,"Benin",23,"Africa",{"$f":"VLOOKUP(Table1[[#This Row],[Price Region]],PRICEREGIONLIST,2,FALSE)","v":"1"},{"$f":"VLOOKUP(Table1[[#This Row],[Price Region]],PRICEREGIONLIST,3,FALSE)","v":"USD"},{"$f":"IFERROR(VLOOKUP(Table1[[#This Row],[Country Name]],EXCOUNTRYLIST,1,FALSE)<>\"N/A\",\"FALSE\")","v":"FALSE"},{"$f":"VLOOKUP(Table1[[#This Row],[Price Region]],PRICEREGIONLIST,4,FALSE)","v":false},{"$f":"VLOOKUP(Table1[[#This Row],[Price Region]],PRICEREGIONLIST,5,FALSE)","v":false},null,"Russia",20,"RUB",false,false,null,null,null,null,null,null,null,null,null,null,"Italy",23]
[null,"Bermuda",24,"Latam PR/BM/CI/VI",{"$f":"VLOOKUP(Table1[[#This Row],[Price Region]],PRICEREGIONLIST,2,FALSE)","v":15},{"$f":"VLOOKUP(Table1[[#This Row],[Price Region]],PRICEREGIONLIST,3,FALSE)","v":"USD"},{"$f":"IFERROR(VLOOKUP(Table1[[#This Row],[Country Name]],EXCOUNTRYLIST,1,FALSE)<>\"N/A\",\"FALSE\")","v":"FALSE"},{"$f":"VLOOKUP(Table1[[#This Row],[Price Region]],PRICEREGIONLIST,4,FALSE)","v":false},{"$f":"VLOOKUP(Table1[[#This Row],[Price Region]],PRICEREGIONLIST,5,FALSE)","v":false},null,"Serbia",21,"USD",false,false,null,null,null,null,null,null,null,null,null,null,"Latvia",24]
[null,"Bhutan",25,"South East Asia",{"$f":"VLOOKUP(Table1[[#This Row],[Price Region]],PRICEREGIONLIST,2,FALSE)","v":23},{"$f":"VLOOKUP(Table1[[#This Row],[Price Region]],PRICEREGIONLIST,3,FALSE)","v":"USD"},{"$f":"IFERROR(VLOOKUP(Table1[[#This Row],[Country Name]],EXCOUNTRYLIST,1,FALSE)<>\"N/A\",\"FALSE\")","v":"FALSE"},{"$f":"VLOOKUP(Table1[[#This Row],[Price Region]],PRICEREGIONLIST,4,FALSE)","v":false},{"$f":"VLOOKUP(Table1[[#This Row],[Price Region]],PRICEREGIONLIST,5,FALSE)","v":false},null,"South Africa",22,"USD",false,false,null,null,null,null,null,null,null,null,null,null,"Lithuania",25]
[null,"Bolivia",26,"Rest of Latam",{"$f":"VLOOKUP(Table1[[#This Row],[Price Region]],PRICEREGIONLIST,2,FALSE)","v":19},{"$f":"VLOOKUP(Table1[[#This Row],[Price Region]],PRICEREGIONLIST,3,FALSE)","v":"USD"},{"$f":"IFERROR(VLOOKUP(Table1[[#This Row],[Country Name]],EXCOUNTRYLIST,1,FALSE)<>\"N/A\",\"FALSE\")","v":"FALSE"},{"$f":"VLOOKUP(Table1[[#This Row],[Price Region]],PRICEREGIONLIST,4,FALSE)","v":false},{"$f":"VLOOKUP(Table1[[#This Row],[Price Region]],PRICEREGIONLIST,5,FALSE)","v":false},null,"South East Asia",23,"USD",false,false,null,null,null,null,null,null,null,null,null,null,"Malaysia",26]
[null,"Bosnia and Herzegovina",27,"Eastern Europe 1",{"$f":"VLOOKUP(Table1[[#This Row],[Price Region]],PRICEREGIONLIST,2,FALSE)","v":10},{"$f":"VLOOKUP(Table1[[#This Row],[Price Region]],PRICEREGIONLIST,3,FALSE)","v":"USD"},{"$f":"IFERROR(VLOOKUP(Table1[[#This Row],[Country Name]],EXCOUNTRYLIST,1,FALSE)<>\"N/A\",\"FALSE\")","v":"FALSE"},{"$f":"VLOOKUP(Table1[[#This Row],[Price Region]],PRICEREGIONLIST,4,FALSE)","v":false},{"$f":"VLOOKUP(Table1[[#This Row],[Price Region]],PRICEREGIONLIST,5,FALSE)","v":false},null,"Sweden2",29,"SEK",true,true,null,null,null,null,null,null,null,null,null,null,"Malta",27]
[null,"Botswana",28,"Africa",{"$f":"VLOOKUP(Table1[[#This Row],[Price Region]],PRICEREGIONLIST,2,FALSE)","v":"1"},{"$f":"VLOOKUP(Table1[[#This Row],[Price Region]],PRICEREGIONLIST,3,FALSE)","v":"USD"},{"$f":"IFERROR(VLOOKUP(Table1[[#This Row],[Country Name]],EXCOUNTRYLIST,1,FALSE)<>\"N/A\",\"FALSE\")","v":"FALSE"},{"$f":"VLOOKUP(Table1[[#This Row],[Price Region]],PRICEREGIONLIST,4,FALSE)","v":false},{"$f":"VLOOKUP(Table1[[#This Row],[Price Region]],PRICEREGIONLIST,5,FALSE)","v":false},null,"Switzerland2",30,"CHF",true,true,null,null,null,null,null,null,null,null,null,null,"Mexico",28]
[null,"Bouvet Island",29,"Norway2",{"$f":"VLOOKUP(Table1[[#This Row],[Price Region]],PRICEREGIONLIST,2,FALSE)","v":28},{"$f":"VLOOKUP(Table1[[#This Row],[Price Region]],PRICEREGIONLIST,3,FALSE)","v":"NOK"},{"$f":"IFERROR(VLOOKUP(Table1[[#This Row],[Country Name]],EXCOUNTRYLIST,1,FALSE)<>\"N/A\",\"FALSE\")","v":"FALSE"},{"$f":"VLOOKUP(Table1[[#This Row],[Price Region]],PRICEREGIONLIST,4,FALSE)","v":true},{"$f":"VLOOKUP(Table1[[#This Row],[Price Region]],PRICEREGIONLIST,5,FALSE)","v":true},null,"Turkey",24,"USD",false,false,null,null,null,null,null,null,null,null,null,null,"Middle East",29]
[null,"Brazil",30,"Rest of Latam",{"$f":"VLOOKUP(Table1[[#This Row],[Price Region]],PRICEREGIONLIST,2,FALSE)","v":19},{"$f":"VLOOKUP(Table1[[#This Row],[Price Region]],PRICEREGIONLIST,3,FALSE)","v":"USD"},{"$f":"IFERROR(VLOOKUP(Table1[[#This Row],[Country Name]],EXCOUNTRYLIST,1,FALSE)<>\"N/A\",\"FALSE\")","v":true},{"$f":"VLOOKUP(Table1[[#This Row],[Price Region]],PRICEREGIONLIST,4,FALSE)","v":false},{"$f":"VLOOKUP(Table1[[#This Row],[Price Region]],PRICEREGIONLIST,5,FALSE)","v":false},null,"United Kingdom2",31,"GBP",true,true,null,null,null,null,null,null,null,null,null,null,"Netherlands",30]
[null,"British Indian Ocean Territory",31,"South East Asia",{"$f":"VLOOKUP(Table1[[#This Row],[Price Region]],PRICEREGIONLIST,2,FALSE)","v":23},{"$f":"VLOOKUP(Table1[[#This Row],[Price Region]],PRICEREGIONLIST,3,FALSE)","v":"USD"},{"$f":"IFERROR(VLOOKUP(Table1[[#This Row],[Country Name]],EXCOUNTRYLIST,1,FALSE)<>\"N/A\",\"FALSE\")","v":"FALSE"},{"$f":"VLOOKUP(Table1[[#This Row],[Price Region]],PRICEREGIONLIST,4,FALSE)","v":false},{"$f":"VLOOKUP(Table1[[#This Row],[Price Region]],PRICEREGIONLIST,5,FALSE)","v":false},null,"United States",25,"USD",false,false,null,null,null,null,null,null,null,null,null,null,"New Zealand",31]
[null,"Brunei",32,"South East Asia",{"$f":"VLOOKUP(Table1[[#This Row],[Price Region]],PRICEREGIONLIST,2,FALSE)","v":23},{"$f":"VLOOKUP(Table1[[#This Row],[Price Region]],PRICEREGIONLIST,3,FALSE)","v":"USD"},{"$f":"IFERROR(VLOOKUP(Table1[[#This Row],[Country Name]],EXCOUNTRYLIST,1,FALSE)<>\"N/A\",\"FALSE\")","v":"FALSE"},{"$f":"VLOOKUP(Table1[[#This Row],[Price Region]],PRICEREGIONLIST,4,FALSE)","v":false},{"$f":"VLOOKUP(Table1[[#This Row],[Price Region]],PRICEREGIONLIST,5,FALSE)","v":false},null,null,null,null,null,null,null,null,null,null,null,null,null,null,null,null,"North Africa",32]
[null,"Bulgaria",33,"Eurozone",{"$f":"VLOOKUP(Table1[[#This Row],[Price Region]],PRICEREGIONLIST,2,FALSE)","v":26},{"$f":"VLOOKUP(Table1[[#This Row],[Price Region]],PRICEREGIONLIST,3,FALSE)","v":"EUR"},{"$f":"IFERROR(VLOOKUP(Table1[[#This Row],[Country Name]],EXCOUNTRYLIST,1,FALSE)<>\"N/A\",\"FALSE\")","v":"FALSE"},{"$f":"VLOOKUP(Table1[[#This Row],[Price Region]],PRICEREGIONLIST,4,FALSE)","v":true},{"$f":"VLOOKUP(Table1[[#This Row],[Price Region]],PRICEREGIONLIST,5,FALSE)","v":false},null,null,null,null,null,null,null,null,null,null,null,null,null,null,null,null,"Norway",33]
[null,"Burkina Faso",34,"Africa",{"$f":"VLOOKUP(Table1[[#This Row],[Price Region]],PRICEREGIONLIST,2,FALSE)","v":"1"},{"$f":"VLOOKUP(Table1[[#This Row],[Price Region]],PRICEREGIONLIST,3,FALSE)","v":"USD"},{"$f":"IFERROR(VLOOKUP(Table1[[#This Row],[Country Name]],EXCOUNTRYLIST,1,FALSE)<>\"N/A\",\"FALSE\")","v":"FALSE"},{"$f":"VLOOKUP(Table1[[#This Row],[Price Region]],PRICEREGIONLIST,4,FALSE)","v":false},{"$f":"VLOOKUP(Table1[[#This Row],[Price Region]],PRICEREGIONLIST,5,FALSE)","v":false},null,null,null,null,null,null,null,null,null,null,null,null,null,null,null,null,"Philippines",34]
[null,"Burundi",35,"Africa",{"$f":"VLOOKUP(Table1[[#This Row],[Price Region]],PRICEREGIONLIST,2,FALSE)","v":"1"},{"$f":"VLOOKUP(Table1[[#This Row],[Price Region]],PRICEREGIONLIST,3,FALSE)","v":"USD"},{"$f":"IFERROR(VLOOKUP(Table1[[#This Row],[Country Name]],EXCOUNTRYLIST,1,FALSE)<>\"N/A\",\"FALSE\")","v":"FALSE"},{"$f":"VLOOKUP(Table1[[#This Row],[Price Region]],PRICEREGIONLIST,4,FALSE)","v":false},{"$f":"VLOOKUP(Table1[[#This Row],[Price Region]],PRICEREGIONLIST,5,FALSE)","v":false},null,null,null,null,null,null,null,null,null,null,null,null,null,null,null,null,"Poland",35]
[null,"Cambodia",36,"South East Asia",{"$f":"VLOOKUP(Table1[[#This Row],[Price Region]],PRICEREGIONLIST,2,FALSE)","v":23},{"$f":"VLOOKUP(Table1[[#This Row],[Price Region]],PRICEREGIONLIST,3,FALSE)","v":"USD"},{"$f":"IFERROR(VLOOKUP(Table1[[#This Row],[Country Name]],EXCOUNTRYLIST,1,FALSE)<>\"N/A\",\"FALSE\")","v":"FALSE"},{"$f":"VLOOKUP(Table1[[#This Row],[Price Region]],PRICEREGIONLIST,4,FALSE)","v":false},{"$f":"VLOOKUP(Table1[[#This Row],[Price Region]],PRICEREGIONLIST,5,FALSE)","v":false},null,null,null,null,null,null,null,null,null,null,null,null,null,null,null,null,"Portugal",36]
[null,"Cameroon",37,"Africa",{"$f":"VLOOKUP(Table1[[#This Row],[Price Region]],PRICEREGIONLIST,2,FALSE)","v":"1"},{"$f":"VLOOKUP(Table1[[#This Row],[Price Region]],PRICEREGIONLIST,3,FALSE)","v":"USD"},{"$f":"IFERROR(VLOOKUP(Table1[[#This Row],[Country Name]],EXCOUNTRYLIST,1,FALSE)<>\"N/A\",\"FALSE\")","v":"FALSE"},{"$f":"VLOOKUP(Table1[[#This Row],[Price Region]],PRICEREGIONLIST,4,FALSE)","v":false},{"$f":"VLOOKUP(Table1[[#This Row],[Price Region]],PRICEREGIONLIST,5,FALSE)","v":false},null,null,null,null,null,null,null,null,null,null,null,null,null,null,null,null,"Romania",37]
[null,"Canada",38,"Canada",{"$f":"VLOOKUP(Table1[[#This Row],[Price Region]],PRICEREGIONLIST,2,FALSE)","v":4},{"$f":"VLOOKUP(Table1[[#This Row],[Price Region]],PRICEREGIONLIST,3,FALSE)","v":"CAD"},{"$f":"IFERROR(VLOOKUP(Table1[[#This Row],[Country Name]],EXCOUNTRYLIST,1,FALSE)<>\"N/A\",\"FALSE\")","v":"FALSE"},{"$f":"VLOOKUP(Table1[[#This Row],[Price Region]],PRICEREGIONLIST,4,FALSE)","v":false},{"$f":"VLOOKUP(Table1[[#This Row],[Price Region]],PRICEREGIONLIST,5,FALSE)","v":false},null,null,null,null,null,null,null,null,null,null,null,null,null,null,null,null,"Russia",38]
[null,"Cape Verde",39,"Africa",{"$f":"VLOOKUP(Table1[[#This Row],[Price Region]],PRICEREGIONLIST,2,FALSE)","v":"1"},{"$f":"VLOOKUP(Table1[[#This Row],[Price Region]],PRICEREGIONLIST,3,FALSE)","v":"USD"},{"$f":"IFERROR(VLOOKUP(Table1[[#This Row],[Country Name]],EXCOUNTRYLIST,1,FALSE)<>\"N/A\",\"FALSE\")","v":"FALSE"},{"$f":"VLOOKUP(Table1[[#This Row],[Price Region]],PRICEREGIONLIST,4,FALSE)","v":false},{"$f":"VLOOKUP(Table1[[#This Row],[Price Region]],PRICEREGIONLIST,5,FALSE)","v":false},null,null,null,null,null,null,null,null,null,null,null,null,null,null,null,null,"Serbia/Montenegro",39]
[null,"Cayman Islands",40,"Latam PR/BM/CI/VI",{"$f":"VLOOKUP(Table1[[#This Row],[Price Region]],PRICEREGIONLIST,2,FALSE)","v":15},{"$f":"VLOOKUP(Table1[[#This Row],[Price Region]],PRICEREGIONLIST,3,FALSE)","v":"USD"},{"$f":"IFERROR(VLOOKUP(Table1[[#This Row],[Country Name]],EXCOUNTRYLIST,1,FALSE)<>\"N/A\",\"FALSE\")","v":"FALSE"},{"$f":"VLOOKUP(Table1[[#This Row],[Price Region]],PRICEREGIONLIST,4,FALSE)","v":false},{"$f":"VLOOKUP(Table1[[#This Row],[Price Region]],PRICEREGIONLIST,5,FALSE)","v":false},null,null,null,null,null,null,null,null,null,null,null,null,null,null,null,null,"Singapore",40]
[null,"Central African Republic",41,"Africa",{"$f":"VLOOKUP(Table1[[#This Row],[Price Region]],PRICEREGIONLIST,2,FALSE)","v":"1"},{"$f":"VLOOKUP(Table1[[#This Row],[Price Region]],PRICEREGIONLIST,3,FALSE)","v":"USD"},{"$f":"IFERROR(VLOOKUP(Table1[[#This Row],[Country Name]],EXCOUNTRYLIST,1,FALSE)<>\"N/A\",\"FALSE\")","v":"FALSE"},{"$f":"VLOOKUP(Table1[[#This Row],[Price Region]],PRICEREGIONLIST,4,FALSE)","v":false},{"$f":"VLOOKUP(Table1[[#This Row],[Price Region]],PRICEREGIONLIST,5,FALSE)","v":false},null,null,null,null,null,null,null,null,null,null,null,null,null,null,null,null,"Slovak Republic",41]
[null,"Chad",42,"Africa",{"$f":"VLOOKUP(Table1[[#This Row],[Price Region]],PRICEREGIONLIST,2,FALSE)","v":"1"},{"$f":"VLOOKUP(Table1[[#This Row],[Price Region]],PRICEREGIONLIST,3,FALSE)","v":"USD"},{"$f":"IFERROR(VLOOKUP(Table1[[#This Row],[Country Name]],EXCOUNTRYLIST,1,FALSE)<>\"N/A\",\"FALSE\")","v":"FALSE"},{"$f":"VLOOKUP(Table1[[#This Row],[Price Region]],PRICEREGIONLIST,4,FALSE)","v":false},{"$f":"VLOOKUP(Table1[[#This Row],[Price Region]],PRICEREGIONLIST,5,FALSE)","v":false},null,null,null,null,null,null,null,null,null,null,null,null,null,null,null,null,"Slovenia",42]
[null,"Chile",43,"Chile",{"$f":"VLOOKUP(Table1[[#This Row],[Price Region]],PRICEREGIONLIST,2,FALSE)","v":7},{"$f":"VLOOKUP(Table1[[#This Row],[Price Region]],PRICEREGIONLIST,3,FALSE)","v":"USD"},{"$f":"IFERROR(VLOOKUP(Table1[[#This Row],[Country Name]],EXCOUNTRYLIST,1,FALSE)<>\"N/A\",\"FALSE\")","v":"FALSE"},{"$f":"VLOOKUP(Table1[[#This Row],[Price Region]],PRICEREGIONLIST,4,FALSE)","v":false},{"$f":"VLOOKUP(Table1[[#This Row],[Price Region]],PRICEREGIONLIST,5,FALSE)","v":false},null,null,null,null,null,null,null,null,null,null,null,null,null,null,null,null,"South Africa",43]
[null,"China",44,"China",{"$f":"VLOOKUP(Table1[[#This Row],[Price Region]],PRICEREGIONLIST,2,FALSE)","v":8},{"$f":"VLOOKUP(Table1[[#This Row],[Price Region]],PRICEREGIONLIST,3,FALSE)","v":"RMB"},{"$f":"IFERROR(VLOOKUP(Table1[[#This Row],[Country Name]],EXCOUNTRYLIST,1,FALSE)<>\"N/A\",\"FALSE\")","v":"FALSE"},{"$f":"VLOOKUP(Table1[[#This Row],[Price Region]],PRICEREGIONLIST,4,FALSE)","v":false},{"$f":"VLOOKUP(Table1[[#This Row],[Price Region]],PRICEREGIONLIST,5,FALSE)","v":false},null,null,null,null,null,null,null,null,null,null,null,null,null,null,null,null,"Spain",44]
[null,"Christmas Island",45,"Australia",{"$f":"VLOOKUP(Table1[[#This Row],[Price Region]],PRICEREGIONLIST,2,FALSE)","v":3},{"$f":"VLOOKUP(Table1[[#This Row],[Price Region]],PRICEREGIONLIST,3,FALSE)","v":"AUD"},{"$f":"IFERROR(VLOOKUP(Table1[[#This Row],[Country Name]],EXCOUNTRYLIST,1,FALSE)<>\"N/A\",\"FALSE\")","v":"FALSE"},{"$f":"VLOOKUP(Table1[[#This Row],[Price Region]],PRICEREGIONLIST,4,FALSE)","v":false},{"$f":"VLOOKUP(Table1[[#This Row],[Price Region]],PRICEREGIONLIST,5,FALSE)","v":false},null,null,null,null,null,null,null,null,null,null,null,null,null,null,null,null,"Sweden",45]
[null,"Cocos (Keeling) Islands",46,"Australia",{"$f":"VLOOKUP(Table1[[#This Row],[Price Region]],PRICEREGIONLIST,2,FALSE)","v":3},{"$f":"VLOOKUP(Table1[[#This Row],[Price Region]],PRICEREGIONLIST,3,FALSE)","v":"AUD"},{"$f":"IFERROR(VLOOKUP(Table1[[#This Row],[Country Name]],EXCOUNTRYLIST,1,FALSE)<>\"N/A\",\"FALSE\")","v":"FALSE"},{"$f":"VLOOKUP(Table1[[#This Row],[Price Region]],PRICEREGIONLIST,4,FALSE)","v":false},{"$f":"VLOOKUP(Table1[[#This Row],[Price Region]],PRICEREGIONLIST,5,FALSE)","v":false},null,null,null,null,null,null,null,null,null,null,null,null,null,null,null,null,"Switzerland",46]
[null,"Colombia",47,"Colombia",{"$f":"VLOOKUP(Table1[[#This Row],[Price Region]],PRICEREGIONLIST,2,FALSE)","v":9},{"$f":"VLOOKUP(Table1[[#This Row],[Price Region]],PRICEREGIONLIST,3,FALSE)","v":"USD"},{"$f":"IFERROR(VLOOKUP(Table1[[#This Row],[Country Name]],EXCOUNTRYLIST,1,FALSE)<>\"N/A\",\"FALSE\")","v":"FALSE"},{"$f":"VLOOKUP(Table1[[#This Row],[Price Region]],PRICEREGIONLIST,4,FALSE)","v":false},{"$f":"VLOOKUP(Table1[[#This Row],[Price Region]],PRICEREGIONLIST,5,FALSE)","v":false},null,null,null,null,null,null,null,null,null,null,null,null,null,null,null,null,"Thailand",47]
[null,"Comoros",48,"Africa",{"$f":"VLOOKUP(Table1[[#This Row],[Price Region]],PRICEREGIONLIST,2,FALSE)","v":"1"},{"$f":"VLOOKUP(Table1[[#This Row],[Price Region]],PRICEREGIONLIST,3,FALSE)","v":"USD"},{"$f":"IFERROR(VLOOKUP(Table1[[#This Row],[Country Name]],EXCOUNTRYLIST,1,FALSE)<>\"N/A\",\"FALSE\")","v":"FALSE"},{"$f":"VLOOKUP(Table1[[#This Row],[Price Region]],PRICEREGIONLIST,4,FALSE)","v":false},{"$f":"VLOOKUP(Table1[[#This Row],[Price Region]],PRICEREGIONLIST,5,FALSE)","v":false},null,null,null,null,null,null,null,null,null,null,null,null,null,null,null,null,"Turkey",48]
[null,"Congo",49,"Africa",{"$f":"VLOOKUP(Table1[[#This Row],[Price Region]],PRICEREGIONLIST,2,FALSE)","v":"1"},{"$f":"VLOOKUP(Table1[[#This Row],[Price Region]],PRICEREGIONLIST,3,FALSE)","v":"USD"},{"$f":"IFERROR(VLOOKUP(Table1[[#This Row],[Country Name]],EXCOUNTRYLIST,1,FALSE)<>\"N/A\",\"FALSE\")","v":"FALSE"},{"$f":"VLOOKUP(Table1[[#This Row],[Price Region]],PRICEREGIONLIST,4,FALSE)","v":false},{"$f":"VLOOKUP(Table1[[#This Row],[Price Region]],PRICEREGIONLIST,5,FALSE)","v":false},null,null,null,null,null,null,null,null,null,null,null,null,null,null,null,null,"United States",49]
[null,"Congo (DRC)",50,"Africa",{"$f":"VLOOKUP(Table1[[#This Row],[Price Region]],PRICEREGIONLIST,2,FALSE)","v":"1"},{"$f":"VLOOKUP(Table1[[#This Row],[Price Region]],PRICEREGIONLIST,3,FALSE)","v":"USD"},{"$f":"IFERROR(VLOOKUP(Table1[[#This Row],[Country Name]],EXCOUNTRYLIST,1,FALSE)<>\"N/A\",\"FALSE\")","v":"FALSE"},{"$f":"VLOOKUP(Table1[[#This Row],[Price Region]],PRICEREGIONLIST,4,FALSE)","v":false},{"$f":"VLOOKUP(Table1[[#This Row],[Price Region]],PRICEREGIONLIST,5,FALSE)","v":false},null,null,null,null,null,null,null,null,null,null,null,null,null,null,null,null,"W1",50]
[null,"Cook Islands",51,"New Zealand",{"$f":"VLOOKUP(Table1[[#This Row],[Price Region]],PRICEREGIONLIST,2,FALSE)","v":18},{"$f":"VLOOKUP(Table1[[#This Row],[Price Region]],PRICEREGIONLIST,3,FALSE)","v":"NZD"},{"$f":"IFERROR(VLOOKUP(Table1[[#This Row],[Country Name]],EXCOUNTRYLIST,1,FALSE)<>\"N/A\",\"FALSE\")","v":"FALSE"},{"$f":"VLOOKUP(Table1[[#This Row],[Price Region]],PRICEREGIONLIST,4,FALSE)","v":false},{"$f":"VLOOKUP(Table1[[#This Row],[Price Region]],PRICEREGIONLIST,5,FALSE)","v":false},null,null,null,null,null,null,null,null,null,null,null,null,null,null,null,null,"WECA",51]
[null,"Costa Rica",52,"Rest of Latam",{"$f":"VLOOKUP(Table1[[#This Row],[Price Region]],PRICEREGIONLIST,2,FALSE)","v":19},{"$f":"VLOOKUP(Table1[[#This Row],[Price Region]],PRICEREGIONLIST,3,FALSE)","v":"USD"},{"$f":"IFERROR(VLOOKUP(Table1[[#This Row],[Country Name]],EXCOUNTRYLIST,1,FALSE)<>\"N/A\",\"FALSE\")","v":"FALSE"},{"$f":"VLOOKUP(Table1[[#This Row],[Price Region]],PRICEREGIONLIST,4,FALSE)","v":false},{"$f":"VLOOKUP(Table1[[#This Row],[Price Region]],PRICEREGIONLIST,5,FALSE)","v":false}]
[null,"Côte d'Ivoire",53,"Africa",{"$f":"VLOOKUP(Table1[[#This Row],[Price Region]],PRICEREGIONLIST,2,FALSE)","v":"1"},{"$f":"VLOOKUP(Table1[[#This Row],[Price Region]],PRICEREGIONLIST,3,FALSE)","v":"USD"},{"$f":"IFERROR(VLOOKUP(Table1[[#This Row],[Country Name]],EXCOUNTRYLIST,1,FALSE)<>\"N/A\",\"FALSE\")","v":"FALSE"},{"$f":"VLOOKUP(Table1[[#This Row],[Price Region]],PRICEREGIONLIST,4,FALSE)","v":false},{"$f":"VLOOKUP(Table1[[#This Row],[Price Region]],PRICEREGIONLIST,5,FALSE)","v":false}]
[null,"Croatia",54,"Eurozone",{"$f":"VLOOKUP(Table1[[#This Row],[Price Region]],PRICEREGIONLIST,2,FALSE)","v":26},{"$f":"VLOOKUP(Table1[[#This Row],[Price Region]],PRICEREGIONLIST,3,FALSE)","v":"EUR"},{"$f":"IFERROR(VLOOKUP(Table1[[#This Row],[Country Name]],EXCOUNTRYLIST,1,FALSE)<>\"N/A\",\"FALSE\")","v":"FALSE"},{"$f":"VLOOKUP(Table1[[#This Row],[Price Region]],PRICEREGIONLIST,4,FALSE)","v":true},{"$f":"VLOOKUP(Table1[[#This Row],[Price Region]],PRICEREGIONLIST,5,FALSE)","v":false}]
[null,"Cuba",55,"Latam Caribbean",{"$f":"VLOOKUP(Table1[[#This Row],[Price Region]],PRICEREGIONLIST,2,FALSE)","v":14},{"$f":"VLOOKUP(Table1[[#This Row],[Price Region]],PRICEREGIONLIST,3,FALSE)","v":"USD"},{"$f":"IFERROR(VLOOKUP(Table1[[#This Row],[Country Name]],EXCOUNTRYLIST,1,FALSE)<>\"N/A\",\"FALSE\")","v":true},{"$f":"VLOOKUP(Table1[[#This Row],[Price Region]],PRICEREGIONLIST,4,FALSE)","v":false},{"$f":"VLOOKUP(Table1[[#This Row],[Price Region]],PRICEREGIONLIST,5,FALSE)","v":false}]
[null,"Cyprus",56,"Eurozone",{"$f":"VLOOKUP(Table1[[#This Row],[Price Region]],PRICEREGIONLIST,2,FALSE)","v":26},{"$f":"VLOOKUP(Table1[[#This Row],[Price Region]],PRICEREGIONLIST,3,FALSE)","v":"EUR"},{"$f":"IFERROR(VLOOKUP(Table1[[#This Row],[Country Name]],EXCOUNTRYLIST,1,FALSE)<>\"N/A\",\"FALSE\")","v":"FALSE"},{"$f":"VLOOKUP(Table1[[#This Row],[Price Region]],PRICEREGIONLIST,4,FALSE)","v":true},{"$f":"VLOOKUP(Table1[[#This Row],[Price Region]],PRICEREGIONLIST,5,FALSE)","v":false}]
[null,"Czech Republic",57,"Eurozone",{"$f":"VLOOKUP(Table1[[#This Row],[Price Region]],PRICEREGIONLIST,2,FALSE)","v":26},{"$f":"VLOOKUP(Table1[[#This Row],[Price Region]],PRICEREGIONLIST,3,FALSE)","v":"EUR"},{"$f":"IFERROR(VLOOKUP(Table1[[#This Row],[Country Name]],EXCOUNTRYLIST,1,FALSE)<>\"N/A\",\"FALSE\")","v":"FALSE"},{"$f":"VLOOKUP(Table1[[#This Row],[Price Region]],PRICEREGIONLIST,4,FALSE)","v":true},{"$f":"VLOOKUP(Table1[[#This Row],[Price Region]],PRICEREGIONLIST,5,FALSE)","v":false}]
[null,"Denmark",58,"Denmark2",{"$f":"VLOOKUP(Table1[[#This Row],[Price Region]],PRICEREGIONLIST,2,FALSE)","v":27},{"$f":"VLOOKUP(Table1[[#This Row],[Price Region]],PRICEREGIONLIST,3,FALSE)","v":"DKK"},{"$f":"IFERROR(VLOOKUP(Table1[[#This Row],[Country Name]],EXCOUNTRYLIST,1,FALSE)<>\"N/A\",\"FALSE\")","v":"FALSE"},{"$f":"VLOOKUP(Table1[[#This Row],[Price Region]],PRICEREGIONLIST,4,FALSE)","v":true},{"$f":"VLOOKUP(Table1[[#This Row],[Price Region]],PRICEREGIONLIST,5,FALSE)","v":true}]
[null,"Djibouti",59,"Africa",{"$f":"VLOOKUP(Table1[[#This Row],[Price Region]],PRICEREGIONLIST,2,FALSE)","v":"1"},{"$f":"VLOOKUP(Table1[[#This Row],[Price Region]],PRICEREGIONLIST,3,FALSE)","v":"USD"},{"$f":"IFERROR(VLOOKUP(Table1[[#This Row],[Country Name]],EXCOUNTRYLIST,1,FALSE)<>\"N/A\",\"FALSE\")","v":"FALSE"},{"$f":"VLOOKUP(Table1[[#This Row],[Price Region]],PRICEREGIONLIST,4,FALSE)","v":false},{"$f":"VLOOKUP(Table1[[#This Row],[Price Region]],PRICEREGIONLIST,5,FALSE)","v":false}]
[null,"Dominica",60,"Latam Caribbean",{"$f":"VLOOKUP(Table1[[#This Row],[Price Region]],PRICEREGIONLIST,2,FALSE)","v":14},{"$f":"VLOOKUP(Table1[[#This Row],[Price Region]],PRICEREGIONLIST,3,FALSE)","v":"USD"},{"$f":"IFERROR(VLOOKUP(Table1[[#This Row],[Country Name]],EXCOUNTRYLIST,1,FALSE)<>\"N/A\",\"FALSE\")","v":"FALSE"},{"$f":"VLOOKUP(Table1[[#This Row],[Price Region]],PRICEREGIONLIST,4,FALSE)","v":false},{"$f":"VLOOKUP(Table1[[#This Row],[Price Region]],PRICEREGIONLIST,5,FALSE)","v":false}]
[null,"Dominican Republic",61,"Rest of Latam",{"$f":"VLOOKUP(Table1[[#This Row],[Price Region]],PRICEREGIONLIST,2,FALSE)","v":19},{"$f":"VLOOKUP(Table1[[#This Row],[Price Region]],PRICEREGIONLIST,3,FALSE)","v":"USD"},{"$f":"IFERROR(VLOOKUP(Table1[[#This Row],[Country Name]],EXCOUNTRYLIST,1,FALSE)<>\"N/A\",\"FALSE\")","v":"FALSE"},{"$f":"VLOOKUP(Table1[[#This Row],[Price Region]],PRICEREGIONLIST,4,FALSE)","v":false},{"$f":"VLOOKUP(Table1[[#This Row],[Price Region]],PRICEREGIONLIST,5,FALSE)","v":false}]
[null,"Ecuador",62,"Rest of Latam",{"$f":"VLOOKUP(Table1[[#This Row],[Price Region]],PRICEREGIONLIST,2,FALSE)","v":19},{"$f":"VLOOKUP(Table1[[#This Row],[Price Region]],PRICEREGIONLIST,3,FALSE)","v":"USD"},{"$f":"IFERROR(VLOOKUP(Table1[[#This Row],[Country Name]],EXCOUNTRYLIST,1,FALSE)<>\"N/A\",\"FALSE\")","v":"FALSE"},{"$f":"VLOOKUP(Table1[[#This Row],[Price Region]],PRICEREGIONLIST,4,FALSE)","v":false},{"$f":"VLOOKUP(Table1[[#This Row],[Price Region]],PRICEREGIONLIST,5,FALSE)","v":false}]
[null,"Egypt",63,"Africa",{"$f":"VLOOKUP(Table1[[#This Row],[Price Region]],PRICEREGIONLIST,2,FALSE)","v":"1"},{"$f":"VLOOKUP(Table1[[#This Row],[Price Region]],PRICEREGIONLIST,3,FALSE)","v":"USD"},{"$f":"IFERROR(VLOOKUP(Table1[[#This Row],[Country Name]],EXCOUNTRYLIST,1,FALSE)<>\"N/A\",\"FALSE\")","v":"FALSE"},{"$f":"VLOOKUP(Table1[[#This Row],[Price Region]],PRICEREGIONLIST,4,FALSE)","v":false},{"$f":"VLOOKUP(Table1[[#This Row],[Price Region]],PRICEREGIONLIST,5,FALSE)","v":false}]
[null,"El Salvador",64,"Rest of Latam",{"$f":"VLOOKUP(Table1[[#This Row],[Price Region]],PRICEREGIONLIST,2,FALSE)","v":19},{"$f":"VLOOKUP(Table1[[#This Row],[Price Region]],PRICEREGIONLIST,3,FALSE)","v":"USD"},{"$f":"IFERROR(VLOOKUP(Table1[[#This Row],[Country Name]],EXCOUNTRYLIST,1,FALSE)<>\"N/A\",\"FALSE\")","v":"FALSE"},{"$f":"VLOOKUP(Table1[[#This Row],[Price Region]],PRICEREGIONLIST,4,FALSE)","v":false},{"$f":"VLOOKUP(Table1[[#This Row],[Price Region]],PRICEREGIONLIST,5,FALSE)","v":false}]
[null,"Equatorial Guinea",65,"Africa",{"$f":"VLOOKUP(Table1[[#This Row],[Price Region]],PRICEREGIONLIST,2,FALSE)","v":"1"},{"$f":"VLOOKUP(Table1[[#This Row],[Price Region]],PRICEREGIONLIST,3,FALSE)","v":"USD"},{"$f":"IFERROR(VLOOKUP(Table1[[#This Row],[Country Name]],EXCOUNTRYLIST,1,FALSE)<>\"N/A\",\"FALSE\")","v":"FALSE"},{"$f":"VLOOKUP(Table1[[#This Row],[Price Region]],PRICEREGIONLIST,4,FALSE)","v":false},{"$f":"VLOOKUP(Table1[[#This Row],[Price Region]],PRICEREGIONLIST,5,FALSE)","v":false}]
[null,"Eritrea",66,"Africa",{"$f":"VLOOKUP(Table1[[#This Row],[Price Region]],PRICEREGIONLIST,2,FALSE)","v":"1"},{"$f":"VLOOKUP(Table1[[#This Row],[Price Region]],PRICEREGIONLIST,3,FALSE)","v":"USD"},{"$f":"IFERROR(VLOOKUP(Table1[[#This Row],[Country Name]],EXCOUNTRYLIST,1,FALSE)<>\"N/A\",\"FALSE\")","v":"FALSE"},{"$f":"VLOOKUP(Table1[[#This Row],[Price Region]],PRICEREGIONLIST,4,FALSE)","v":false},{"$f":"VLOOKUP(Table1[[#This Row],[Price Region]],PRICEREGIONLIST,5,FALSE)","v":false}]
[null,"Estonia",67,"Eurozone",{"$f":"VLOOKUP(Table1[[#This Row],[Price Region]],PRICEREGIONLIST,2,FALSE)","v":26},{"$f":"VLOOKUP(Table1[[#This Row],[Price Region]],PRICEREGIONLIST,3,FALSE)","v":"EUR"},{"$f":"IFERROR(VLOOKUP(Table1[[#This Row],[Country Name]],EXCOUNTRYLIST,1,FALSE)<>\"N/A\",\"FALSE\")","v":"FALSE"},{"$f":"VLOOKUP(Table1[[#This Row],[Price Region]],PRICEREGIONLIST,4,FALSE)","v":true},{"$f":"VLOOKUP(Table1[[#This Row],[Price Region]],PRICEREGIONLIST,5,FALSE)","v":false}]
[null,"Ethiopia",68,"Africa",{"$f":"VLOOKUP(Table1[[#This Row],[Price Region]],PRICEREGIONLIST,2,FALSE)","v":"1"},{"$f":"VLOOKUP(Table1[[#This Row],[Price Region]],PRICEREGIONLIST,3,FALSE)","v":"USD"},{"$f":"IFERROR(VLOOKUP(Table1[[#This Row],[Country Name]],EXCOUNTRYLIST,1,FALSE)<>\"N/A\",\"FALSE\")","v":"FALSE"},{"$f":"VLOOKUP(Table1[[#This Row],[Price Region]],PRICEREGIONLIST,4,FALSE)","v":false},{"$f":"VLOOKUP(Table1[[#This Row],[Price Region]],PRICEREGIONLIST,5,FALSE)","v":false}]
[null,"Falkland Islands (Islas Malvinas)",69,"Rest of Latam",{"$f":"VLOOKUP(Table1[[#This Row],[Price Region]],PRICEREGIONLIST,2,FALSE)","v":19},{"$f":"VLOOKUP(Table1[[#This Row],[Price Region]],PRICEREGIONLIST,3,FALSE)","v":"USD"},{"$f":"IFERROR(VLOOKUP(Table1[[#This Row],[Country Name]],EXCOUNTRYLIST,1,FALSE)<>\"N/A\",\"FALSE\")","v":"FALSE"},{"$f":"VLOOKUP(Table1[[#This Row],[Price Region]],PRICEREGIONLIST,4,FALSE)","v":false},{"$f":"VLOOKUP(Table1[[#This Row],[Price Region]],PRICEREGIONLIST,5,FALSE)","v":false}]
[null,"Faroe Islands",70,"Denmark2",{"$f":"VLOOKUP(Table1[[#This Row],[Price Region]],PRICEREGIONLIST,2,FALSE)","v":27},{"$f":"VLOOKUP(Table1[[#This Row],[Price Region]],PRICEREGIONLIST,3,FALSE)","v":"DKK"},{"$f":"IFERROR(VLOOKUP(Table1[[#This Row],[Country Name]],EXCOUNTRYLIST,1,FALSE)<>\"N/A\",\"FALSE\")","v":"FALSE"},{"$f":"VLOOKUP(Table1[[#This Row],[Price Region]],PRICEREGIONLIST,4,FALSE)","v":true},{"$f":"VLOOKUP(Table1[[#This Row],[Price Region]],PRICEREGIONLIST,5,FALSE)","v":true}]
[null,"Fiji Islands",71,"South East Asia",{"$f":"VLOOKUP(Table1[[#This Row],[Price Region]],PRICEREGIONLIST,2,FALSE)","v":23},{"$f":"VLOOKUP(Table1[[#This Row],[Price Region]],PRICEREGIONLIST,3,FALSE)","v":"USD"},{"$f":"IFERROR(VLOOKUP(Table1[[#This Row],[Country Name]],EXCOUNTRYLIST,1,FALSE)<>\"N/A\",\"FALSE\")","v":"FALSE"},{"$f":"VLOOKUP(Table1[[#This Row],[Price Region]],PRICEREGIONLIST,4,FALSE)","v":false},{"$f":"VLOOKUP(Table1[[#This Row],[Price Region]],PRICEREGIONLIST,5,FALSE)","v":false}]
[null,"Finland",72,"Eurozone",{"$f":"VLOOKUP(Table1[[#This Row],[Price Region]],PRICEREGIONLIST,2,FALSE)","v":26},{"$f":"VLOOKUP(Table1[[#This Row],[Price Region]],PRICEREGIONLIST,3,FALSE)","v":"EUR"},{"$f":"IFERROR(VLOOKUP(Table1[[#This Row],[Country Name]],EXCOUNTRYLIST,1,FALSE)<>\"N/A\",\"FALSE\")","v":"FALSE"},{"$f":"VLOOKUP(Table1[[#This Row],[Price Region]],PRICEREGIONLIST,4,FALSE)","v":true},{"$f":"VLOOKUP(Table1[[#This Row],[Price Region]],PRICEREGIONLIST,5,FALSE)","v":false}]
[null,"France",73,"Eurozone",{"$f":"VLOOKUP(Table1[[#This Row],[Price Region]],PRICEREGIONLIST,2,FALSE)","v":26},{"$f":"VLOOKUP(Table1[[#This Row],[Price Region]],PRICEREGIONLIST,3,FALSE)","v":"EUR"},{"$f":"IFERROR(VLOOKUP(Table1[[#This Row],[Country Name]],EXCOUNTRYLIST,1,FALSE)<>\"N/A\",\"FALSE\")","v":"FALSE"},{"$f":"VLOOKUP(Table1[[#This Row],[Price Region]],PRICEREGIONLIST,4,FALSE)","v":true},{"$f":"VLOOKUP(Table1[[#This Row],[Price Region]],PRICEREGIONLIST,5,FALSE)","v":false}]
[null,"French Guiana",74,"Eurozone",{"$f":"VLOOKUP(Table1[[#This Row],[Price Region]],PRICEREGIONLIST,2,FALSE)","v":26},{"$f":"VLOOKUP(Table1[[#This Row],[Price Region]],PRICEREGIONLIST,3,FALSE)","v":"EUR"},{"$f":"IFERROR(VLOOKUP(Table1[[#This Row],[Country Name]],EXCOUNTRYLIST,1,FALSE)<>\"N/A\",\"FALSE\")","v":"FALSE"},{"$f":"VLOOKUP(Table1[[#This Row],[Price Region]],PRICEREGIONLIST,4,FALSE)","v":true},{"$f":"VLOOKUP(Table1[[#This Row],[Price Region]],PRICEREGIONLIST,5,FALSE)","v":false}]
[null,"French Polynesia",75,"Africa",{"$f":"VLOOKUP(Table1[[#This Row],[Price Region]],PRICEREGIONLIST,2,FALSE)","v":"1"},{"$f":"VLOOKUP(Table1[[#This Row],[Price Region]],PRICEREGIONLIST,3,FALSE)","v":"USD"},{"$f":"IFERROR(VLOOKUP(Table1[[#This Row],[Country Name]],EXCOUNTRYLIST,1,FALSE)<>\"N/A\",\"FALSE\")","v":"FALSE"},{"$f":"VLOOKUP(Table1[[#This Row],[Price Region]],PRICEREGIONLIST,4,FALSE)","v":false},{"$f":"VLOOKUP(Table1[[#This Row],[Price Region]],PRICEREGIONLIST,5,FALSE)","v":false}]
[null,"French Southern and Antarctic Lands",76,"Eurozone",{"$f":"VLOOKUP(Table1[[#This Row],[Price Region]],PRICEREGIONLIST,2,FALSE)","v":26},{"$f":"VLOOKUP(Table1[[#This Row],[Price Region]],PRICEREGIONLIST,3,FALSE)","v":"EUR"},{"$f":"IFERROR(VLOOKUP(Table1[[#This Row],[Country Name]],EXCOUNTRYLIST,1,FALSE)<>\"N/A\",\"FALSE\")","v":"FALSE"},{"$f":"VLOOKUP(Table1[[#This Row],[Price Region]],PRICEREGIONLIST,4,FALSE)","v":true},{"$f":"VLOOKUP(Table1[[#This Row],[Price Region]],PRICEREGIONLIST,5,FALSE)","v":false}]
[null,"Gabon",77,"Africa",{"$f":"VLOOKUP(Table1[[#This Row],[Price Region]],PRICEREGIONLIST,2,FALSE)","v":"1"},{"$f":"VLOOKUP(Table1[[#This Row],[Price Region]],PRICEREGIONLIST,3,FALSE)","v":"USD"},{"$f":"IFERROR(VLOOKUP(Table1[[#This Row],[Country Name]],EXCOUNTRYLIST,1,FALSE)<>\"N/A\",\"FALSE\")","v":"FALSE"},{"$f":"VLOOKUP(Table1[[#This Row],[Price Region]],PRICEREGIONLIST,4,FALSE)","v":false},{"$f":"VLOOKUP(Table1[[#This Row],[Price Region]],PRICEREGIONLIST,5,FALSE)","v":false}]
[null,"Gambia, The",78,"Africa",{"$f":"VLOOKUP(Table1[[#This Row],[Price Region]],PRICEREGIONLIST,2,FALSE)","v":"1"},{"$f":"VLOOKUP(Table1[[#This Row],[Price Region]],PRICEREGIONLIST,3,FALSE)","v":"USD"},{"$f":"IFERROR(VLOOKUP(Table1[[#This Row],[Country Name]],EXCOUNTRYLIST,1,FALSE)<>\"N/A\",\"FALSE\")","v":"FALSE"},{"$f":"VLOOKUP(Table1[[#This Row],[Price Region]],PRICEREGIONLIST,4,FALSE)","v":false},{"$f":"VLOOKUP(Table1[[#This Row],[Price Region]],PRICEREGIONLIST,5,FALSE)","v":false}]
[null,"Georgia",80,"Eastern Europe 2",{"$f":"VLOOKUP(Table1[[#This Row],[Price Region]],PRICEREGIONLIST,2,FALSE)","v":11},{"$f":"VLOOKUP(Table1[[#This Row],[Price Region]],PRICEREGIONLIST,3,FALSE)","v":"USD"},{"$f":"IFERROR(VLOOKUP(Table1[[#This Row],[Country Name]],EXCOUNTRYLIST,1,FALSE)<>\"N/A\",\"FALSE\")","v":"FALSE"},{"$f":"VLOOKUP(Table1[[#This Row],[Price Region]],PRICEREGIONLIST,4,FALSE)","v":false},{"$f":"VLOOKUP(Table1[[#This Row],[Price Region]],PRICEREGIONLIST,5,FALSE)","v":false}]
[null,"Germany",81,"Eurozone",{"$f":"VLOOKUP(Table1[[#This Row],[Price Region]],PRICEREGIONLIST,2,FALSE)","v":26},{"$f":"VLOOKUP(Table1[[#This Row],[Price Region]],PRICEREGIONLIST,3,FALSE)","v":"EUR"},{"$f":"IFERROR(VLOOKUP(Table1[[#This Row],[Country Name]],EXCOUNTRYLIST,1,FALSE)<>\"N/A\",\"FALSE\")","v":"FALSE"},{"$f":"VLOOKUP(Table1[[#This Row],[Price Region]],PRICEREGIONLIST,4,FALSE)","v":true},{"$f":"VLOOKUP(Table1[[#This Row],[Price Region]],PRICEREGIONLIST,5,FALSE)","v":false}]
[null,"Ghana",82,"Africa",{"$f":"VLOOKUP(Table1[[#This Row],[Price Region]],PRICEREGIONLIST,2,FALSE)","v":"1"},{"$f":"VLOOKUP(Table1[[#This Row],[Price Region]],PRICEREGIONLIST,3,FALSE)","v":"USD"},{"$f":"IFERROR(VLOOKUP(Table1[[#This Row],[Country Name]],EXCOUNTRYLIST,1,FALSE)<>\"N/A\",\"FALSE\")","v":"FALSE"},{"$f":"VLOOKUP(Table1[[#This Row],[Price Region]],PRICEREGIONLIST,4,FALSE)","v":false},{"$f":"VLOOKUP(Table1[[#This Row],[Price Region]],PRICEREGIONLIST,5,FALSE)","v":false}]
[null,"Gibraltar",83,"United Kingdom2",{"$f":"VLOOKUP(Table1[[#This Row],[Price Region]],PRICEREGIONLIST,2,FALSE)","v":31},{"$f":"VLOOKUP(Table1[[#This Row],[Price Region]],PRICEREGIONLIST,3,FALSE)","v":"GBP"},{"$f":"IFERROR(VLOOKUP(Table1[[#This Row],[Country Name]],EXCOUNTRYLIST,1,FALSE)<>\"N/A\",\"FALSE\")","v":"FALSE"},{"$f":"VLOOKUP(Table1[[#This Row],[Price Region]],PRICEREGIONLIST,4,FALSE)","v":true},{"$f":"VLOOKUP(Table1[[#This Row],[Price Region]],PRICEREGIONLIST,5,FALSE)","v":true}]
[null,"Greece",84,"Eurozone",{"$f":"VLOOKUP(Table1[[#This Row],[Price Region]],PRICEREGIONLIST,2,FALSE)","v":26},{"$f":"VLOOKUP(Table1[[#This Row],[Price Region]],PRICEREGIONLIST,3,FALSE)","v":"EUR"},{"$f":"IFERROR(VLOOKUP(Table1[[#This Row],[Country Name]],EXCOUNTRYLIST,1,FALSE)<>\"N/A\",\"FALSE\")","v":"FALSE"},{"$f":"VLOOKUP(Table1[[#This Row],[Price Region]],PRICEREGIONLIST,4,FALSE)","v":true},{"$f":"VLOOKUP(Table1[[#This Row],[Price Region]],PRICEREGIONLIST,5,FALSE)","v":false}]
[null,"Greenland",85,"Denmark2",{"$f":"VLOOKUP(Table1[[#This Row],[Price Region]],PRICEREGIONLIST,2,FALSE)","v":27},{"$f":"VLOOKUP(Table1[[#This Row],[Price Region]],PRICEREGIONLIST,3,FALSE)","v":"DKK"},{"$f":"IFERROR(VLOOKUP(Table1[[#This Row],[Country Name]],EXCOUNTRYLIST,1,FALSE)<>\"N/A\",\"FALSE\")","v":"FALSE"},{"$f":"VLOOKUP(Table1[[#This Row],[Price Region]],PRICEREGIONLIST,4,FALSE)","v":true},{"$f":"VLOOKUP(Table1[[#This Row],[Price Region]],PRICEREGIONLIST,5,FALSE)","v":true}]
[null,"Grenada",86,"Latam Caribbean",{"$f":"VLOOKUP(Table1[[#This Row],[Price Region]],PRICEREGIONLIST,2,FALSE)","v":14},{"$f":"VLOOKUP(Table1[[#This Row],[Price Region]],PRICEREGIONLIST,3,FALSE)","v":"USD"},{"$f":"IFERROR(VLOOKUP(Table1[[#This Row],[Country Name]],EXCOUNTRYLIST,1,FALSE)<>\"N/A\",\"FALSE\")","v":"FALSE"},{"$f":"VLOOKUP(Table1[[#This Row],[Price Region]],PRICEREGIONLIST,4,FALSE)","v":false},{"$f":"VLOOKUP(Table1[[#This Row],[Price Region]],PRICEREGIONLIST,5,FALSE)","v":false}]
[null,"Guadeloupe",87,"Eurozone",{"$f":"VLOOKUP(Table1[[#This Row],[Price Region]],PRICEREGIONLIST,2,FALSE)","v":26},{"$f":"VLOOKUP(Table1[[#This Row],[Price Region]],PRICEREGIONLIST,3,FALSE)","v":"EUR"},{"$f":"IFERROR(VLOOKUP(Table1[[#This Row],[Country Name]],EXCOUNTRYLIST,1,FALSE)<>\"N/A\",\"FALSE\")","v":"FALSE"},{"$f":"VLOOKUP(Table1[[#This Row],[Price Region]],PRICEREGIONLIST,4,FALSE)","v":true},{"$f":"VLOOKUP(Table1[[#This Row],[Price Region]],PRICEREGIONLIST,5,FALSE)","v":false}]
[null,"Guam",88,"APOC United States",{"$f":"VLOOKUP(Table1[[#This Row],[Price Region]],PRICEREGIONLIST,2,FALSE)","v":2},{"$f":"VLOOKUP(Table1[[#This Row],[Price Region]],PRICEREGIONLIST,3,FALSE)","v":"USD"},{"$f":"IFERROR(VLOOKUP(Table1[[#This Row],[Country Name]],EXCOUNTRYLIST,1,FALSE)<>\"N/A\",\"FALSE\")","v":"FALSE"},{"$f":"VLOOKUP(Table1[[#This Row],[Price Region]],PRICEREGIONLIST,4,FALSE)","v":false},{"$f":"VLOOKUP(Table1[[#This Row],[Price Region]],PRICEREGIONLIST,5,FALSE)","v":false}]
[null,"Guatemala",89,"Rest of Latam",{"$f":"VLOOKUP(Table1[[#This Row],[Price Region]],PRICEREGIONLIST,2,FALSE)","v":19},{"$f":"VLOOKUP(Table1[[#This Row],[Price Region]],PRICEREGIONLIST,3,FALSE)","v":"USD"},{"$f":"IFERROR(VLOOKUP(Table1[[#This Row],[Country Name]],EXCOUNTRYLIST,1,FALSE)<>\"N/A\",\"FALSE\")","v":"FALSE"},{"$f":"VLOOKUP(Table1[[#This Row],[Price Region]],PRICEREGIONLIST,4,FALSE)","v":false},{"$f":"VLOOKUP(Table1[[#This Row],[Price Region]],PRICEREGIONLIST,5,FALSE)","v":false}]
[null,"Guinea",90,"Africa",{"$f":"VLOOKUP(Table1[[#This Row],[Price Region]],PRICEREGIONLIST,2,FALSE)","v":"1"},{"$f":"VLOOKUP(Table1[[#This Row],[Price Region]],PRICEREGIONLIST,3,FALSE)","v":"USD"},{"$f":"IFERROR(VLOOKUP(Table1[[#This Row],[Country Name]],EXCOUNTRYLIST,1,FALSE)<>\"N/A\",\"FALSE\")","v":"FALSE"},{"$f":"VLOOKUP(Table1[[#This Row],[Price Region]],PRICEREGIONLIST,4,FALSE)","v":false},{"$f":"VLOOKUP(Table1[[#This Row],[Price Region]],PRICEREGIONLIST,5,FALSE)","v":false}]
[null,"Guinea-Bissau",91,"Africa",{"$f":"VLOOKUP(Table1[[#This Row],[Price Region]],PRICEREGIONLIST,2,FALSE)","v":"1"},{"$f":"VLOOKUP(Table1[[#This Row],[Price Region]],PRICEREGIONLIST,3,FALSE)","v":"USD"},{"$f":"IFERROR(VLOOKUP(Table1[[#This Row],[Country Name]],EXCOUNTRYLIST,1,FALSE)<>\"N/A\",\"FALSE\")","v":"FALSE"},{"$f":"VLOOKUP(Table1[[#This Row],[Price Region]],PRICEREGIONLIST,4,FALSE)","v":false},{"$f":"VLOOKUP(Table1[[#This Row],[Price Region]],PRICEREGIONLIST,5,FALSE)","v":false}]
[null,"Guyana",92,"Latam Caribbean",{"$f":"VLOOKUP(Table1[[#This Row],[Price Region]],PRICEREGIONLIST,2,FALSE)","v":14},{"$f":"VLOOKUP(Table1[[#This Row],[Price Region]],PRICEREGIONLIST,3,FALSE)","v":"USD"},{"$f":"IFERROR(VLOOKUP(Table1[[#This Row],[Country Name]],EXCOUNTRYLIST,1,FALSE)<>\"N/A\",\"FALSE\")","v":"FALSE"},{"$f":"VLOOKUP(Table1[[#This Row],[Price Region]],PRICEREGIONLIST,4,FALSE)","v":false},{"$f":"VLOOKUP(Table1[[#This Row],[Price Region]],PRICEREGIONLIST,5,FALSE)","v":false}]
[null,"Haiti",93,"Latam Caribbean",{"$f":"VLOOKUP(Table1[[#This Row],[Price Region]],PRICEREGIONLIST,2,FALSE)","v":14},{"$f":"VLOOKUP(Table1[[#This Row],[Price Region]],PRICEREGIONLIST,3,FALSE)","v":"USD"},{"$f":"IFERROR(VLOOKUP(Table1[[#This Row],[Country Name]],EXCOUNTRYLIST,1,FALSE)<>\"N/A\",\"FALSE\")","v":"FALSE"},{"$f":"VLOOKUP(Table1[[#This Row],[Price Region]],PRICEREGIONLIST,4,FALSE)","v":false},{"$f":"VLOOKUP(Table1[[#This Row],[Price Region]],PRICEREGIONLIST,5,FALSE)","v":false}]
[null,"Heard Island and McDonald Islands",94,"Australia",{"$f":"VLOOKUP(Table1[[#This Row],[Price Region]],PRICEREGIONLIST,2,FALSE)","v":3},{"$f":"VLOOKUP(Table1[[#This Row],[Price Region]],PRICEREGIONLIST,3,FALSE)","v":"AUD"},{"$f":"IFERROR(VLOOKUP(Table1[[#This Row],[Country Name]],EXCOUNTRYLIST,1,FALSE)<>\"N/A\",\"FALSE\")","v":"FALSE"},{"$f":"VLOOKUP(Table1[[#This Row],[Price Region]],PRICEREGIONLIST,4,FALSE)","v":false},{"$f":"VLOOKUP(Table1[[#This Row],[Price Region]],PRICEREGIONLIST,5,FALSE)","v":false}]
[null,"Honduras",95,"Rest of Latam",{"$f":"VLOOKUP(Table1[[#This Row],[Price Region]],PRICEREGIONLIST,2,FALSE)","v":19},{"$f":"VLOOKUP(Table1[[#This Row],[Price Region]],PRICEREGIONLIST,3,FALSE)","v":"USD"},{"$f":"IFERROR(VLOOKUP(Table1[[#This Row],[Country Name]],EXCOUNTRYLIST,1,FALSE)<>\"N/A\",\"FALSE\")","v":"FALSE"},{"$f":"VLOOKUP(Table1[[#This Row],[Price Region]],PRICEREGIONLIST,4,FALSE)","v":false},{"$f":"VLOOKUP(Table1[[#This Row],[Price Region]],PRICEREGIONLIST,5,FALSE)","v":false}]
[null,"Hong Kong SAR",96,"South East Asia",{"$f":"VLOOKUP(Table1[[#This Row],[Price Region]],PRICEREGIONLIST,2,FALSE)","v":23},{"$f":"VLOOKUP(Table1[[#This Row],[Price Region]],PRICEREGIONLIST,3,FALSE)","v":"USD"},{"$f":"IFERROR(VLOOKUP(Table1[[#This Row],[Country Name]],EXCOUNTRYLIST,1,FALSE)<>\"N/A\",\"FALSE\")","v":"FALSE"},{"$f":"VLOOKUP(Table1[[#This Row],[Price Region]],PRICEREGIONLIST,4,FALSE)","v":false},{"$f":"VLOOKUP(Table1[[#This Row],[Price Region]],PRICEREGIONLIST,5,FALSE)","v":false}]
[null,"Hungary",97,"Eurozone",{"$f":"VLOOKUP(Table1[[#This Row],[Price Region]],PRICEREGIONLIST,2,FALSE)","v":26},{"$f":"VLOOKUP(Table1[[#This Row],[Price Region]],PRICEREGIONLIST,3,FALSE)","v":"EUR"},{"$f":"IFERROR(VLOOKUP(Table1[[#This Row],[Country Name]],EXCOUNTRYLIST,1,FALSE)<>\"N/A\",\"FALSE\")","v":"FALSE"},{"$f":"VLOOKUP(Table1[[#This Row],[Price Region]],PRICEREGIONLIST,4,FALSE)","v":true},{"$f":"VLOOKUP(Table1[[#This Row],[Price Region]],PRICEREGIONLIST,5,FALSE)","v":false}]
[null,"Iceland",98,"Eurozone",{"$f":"VLOOKUP(Table1[[#This Row],[Price Region]],PRICEREGIONLIST,2,FALSE)","v":26},{"$f":"VLOOKUP(Table1[[#This Row],[Price Region]],PRICEREGIONLIST,3,FALSE)","v":"EUR"},{"$f":"IFERROR(VLOOKUP(Table1[[#This Row],[Country Name]],EXCOUNTRYLIST,1,FALSE)<>\"N/A\",\"FALSE\")","v":"FALSE"},{"$f":"VLOOKUP(Table1[[#This Row],[Price Region]],PRICEREGIONLIST,4,FALSE)","v":true},{"$f":"VLOOKUP(Table1[[#This Row],[Price Region]],PRICEREGIONLIST,5,FALSE)","v":false}]
[null,"India",99,"India",{"$f":"VLOOKUP(Table1[[#This Row],[Price Region]],PRICEREGIONLIST,2,FALSE)","v":12},{"$f":"VLOOKUP(Table1[[#This Row],[Price Region]],PRICEREGIONLIST,3,FALSE)","v":"INR"},{"$f":"IFERROR(VLOOKUP(Table1[[#This Row],[Country Name]],EXCOUNTRYLIST,1,FALSE)<>\"N/A\",\"FALSE\")","v":"FALSE"},{"$f":"VLOOKUP(Table1[[#This Row],[Price Region]],PRICEREGIONLIST,4,FALSE)","v":false},{"$f":"VLOOKUP(Table1[[#This Row],[Price Region]],PRICEREGIONLIST,5,FALSE)","v":false}]
[null,"Indonesia",100,"South East Asia",{"$f":"VLOOKUP(Table1[[#This Row],[Price Region]],PRICEREGIONLIST,2,FALSE)","v":23},{"$f":"VLOOKUP(Table1[[#This Row],[Price Region]],PRICEREGIONLIST,3,FALSE)","v":"USD"},{"$f":"IFERROR(VLOOKUP(Table1[[#This Row],[Country Name]],EXCOUNTRYLIST,1,FALSE)<>\"N/A\",\"FALSE\")","v":"FALSE"},{"$f":"VLOOKUP(Table1[[#This Row],[Price Region]],PRICEREGIONLIST,4,FALSE)","v":false},{"$f":"VLOOKUP(Table1[[#This Row],[Price Region]],PRICEREGIONLIST,5,FALSE)","v":false}]
[null,"Iran",101,"Middle East",{"$f":"VLOOKUP(Table1[[#This Row],[Price Region]],PRICEREGIONLIST,2,FALSE)","v":17},{"$f":"VLOOKUP(Table1[[#This Row],[Price Region]],PRICEREGIONLIST,3,FALSE)","v":"USD"},{"$f":"IFERROR(VLOOKUP(Table1[[#This Row],[Country Name]],EXCOUNTRYLIST,1,FALSE)<>\"N/A\",\"FALSE\")","v":true},{"$f":"VLOOKUP(Table1[[#This Row],[Price Region]],PRICEREGIONLIST,4,FALSE)","v":false},{"$f":"VLOOKUP(Table1[[#This Row],[Price Region]],PRICEREGIONLIST,5,FALSE)","v":false}]
[null,"Iraq",102,"Middle East",{"$f":"VLOOKUP(Table1[[#This Row],[Price Region]],PRICEREGIONLIST,2,FALSE)","v":17},{"$f":"VLOOKUP(Table1[[#This Row],[Price Region]],PRICEREGIONLIST,3,FALSE)","v":"USD"},{"$f":"IFERROR(VLOOKUP(Table1[[#This Row],[Country Name]],EXCOUNTRYLIST,1,FALSE)<>\"N/A\",\"FALSE\")","v":"FALSE"},{"$f":"VLOOKUP(Table1[[#This Row],[Price Region]],PRICEREGIONLIST,4,FALSE)","v":false},{"$f":"VLOOKUP(Table1[[#This Row],[Price Region]],PRICEREGIONLIST,5,FALSE)","v":false}]
[null,"Ireland, Republic of",103,"Eurozone",{"$f":"VLOOKUP(Table1[[#This Row],[Price Region]],PRICEREGIONLIST,2,FALSE)","v":26},{"$f":"VLOOKUP(Table1[[#This Row],[Price Region]],PRICEREGIONLIST,3,FALSE)","v":"EUR"},{"$f":"IFERROR(VLOOKUP(Table1[[#This Row],[Country Name]],EXCOUNTRYLIST,1,FALSE)<>\"N/A\",\"FALSE\")","v":"FALSE"},{"$f":"VLOOKUP(Table1[[#This Row],[Price Region]],PRICEREGIONLIST,4,FALSE)","v":true},{"$f":"VLOOKUP(Table1[[#This Row],[Price Region]],PRICEREGIONLIST,5,FALSE)","v":false}]
[null,"Israel",104,"Middle East",{"$f":"VLOOKUP(Table1[[#This Row],[Price Region]],PRICEREGIONLIST,2,FALSE)","v":17},{"$f":"VLOOKUP(Table1[[#This Row],[Price Region]],PRICEREGIONLIST,3,FALSE)","v":"USD"},{"$f":"IFERROR(VLOOKUP(Table1[[#This Row],[Country Name]],EXCOUNTRYLIST,1,FALSE)<>\"N/A\",\"FALSE\")","v":"FALSE"},{"$f":"VLOOKUP(Table1[[#This Row],[Price Region]],PRICEREGIONLIST,4,FALSE)","v":false},{"$f":"VLOOKUP(Table1[[#This Row],[Price Region]],PRICEREGIONLIST,5,FALSE)","v":false}]
[null,"Italy",105,"Eurozone",{"$f":"VLOOKUP(Table1[[#This Row],[Price Region]],PRICEREGIONLIST,2,FALSE)","v":26},{"$f":"VLOOKUP(Table1[[#This Row],[Price Region]],PRICEREGIONLIST,3,FALSE)","v":"EUR"},{"$f":"IFERROR(VLOOKUP(Table1[[#This Row],[Country Name]],EXCOUNTRYLIST,1,FALSE)<>\"N/A\",\"FALSE\")","v":"FALSE"},{"$f":"VLOOKUP(Table1[[#This Row],[Price Region]],PRICEREGIONLIST,4,FALSE)","v":true},{"$f":"VLOOKUP(Table1[[#This Row],[Price Region]],PRICEREGIONLIST,5,FALSE)","v":false}]
[null,"Jamaica",106,"Latam Caribbean",{"$f":"VLOOKUP(Table1[[#This Row],[Price Region]],PRICEREGIONLIST,2,FALSE)","v":14},{"$f":"VLOOKUP(Table1[[#This Row],[Price Region]],PRICEREGIONLIST,3,FALSE)","v":"USD"},{"$f":"IFERROR(VLOOKUP(Table1[[#This Row],[Country Name]],EXCOUNTRYLIST,1,FALSE)<>\"N/A\",\"FALSE\")","v":"FALSE"},{"$f":"VLOOKUP(Table1[[#This Row],[Price Region]],PRICEREGIONLIST,4,FALSE)","v":false},{"$f":"VLOOKUP(Table1[[#This Row],[Price Region]],PRICEREGIONLIST,5,FALSE)","v":false}]
[null,"Japan",107,"Japan",{"$f":"VLOOKUP(Table1[[#This Row],[Price Region]],PRICEREGIONLIST,2,FALSE)","v":13},{"$f":"VLOOKUP(Table1[[#This Row],[Price Region]],PRICEREGIONLIST,3,FALSE)","v":"JPY"},{"$f":"IFERROR(VLOOKUP(Table1[[#This Row],[Country Name]],EXCOUNTRYLIST,1,FALSE)<>\"N/A\",\"FALSE\")","v":"FALSE"},{"$f":"VLOOKUP(Table1[[#This Row],[Price Region]],PRICEREGIONLIST,4,FALSE)","v":false},{"$f":"VLOOKUP(Table1[[#This Row],[Price Region]],PRICEREGIONLIST,5,FALSE)","v":false}]
[null,"Jordan",108,"Middle East",{"$f":"VLOOKUP(Table1[[#This Row],[Price Region]],PRICEREGIONLIST,2,FALSE)","v":17},{"$f":"VLOOKUP(Table1[[#This Row],[Price Region]],PRICEREGIONLIST,3,FALSE)","v":"USD"},{"$f":"IFERROR(VLOOKUP(Table1[[#This Row],[Country Name]],EXCOUNTRYLIST,1,FALSE)<>\"N/A\",\"FALSE\")","v":"FALSE"},{"$f":"VLOOKUP(Table1[[#This Row],[Price Region]],PRICEREGIONLIST,4,FALSE)","v":false},{"$f":"VLOOKUP(Table1[[#This Row],[Price Region]],PRICEREGIONLIST,5,FALSE)","v":false}]
[null,"Kazakhstan",109,"Central Asia 2 - CEE 2",{"$f":"VLOOKUP(Table1[[#This Row],[Price Region]],PRICEREGIONLIST,2,FALSE)","v":6},{"$f":"VLOOKUP(Table1[[#This Row],[Price Region]],PRICEREGIONLIST,3,FALSE)","v":"USD"},{"$f":"IFERROR(VLOOKUP(Table1[[#This Row],[Country Name]],EXCOUNTRYLIST,1,FALSE)<>\"N/A\",\"FALSE\")","v":"FALSE"},{"$f":"VLOOKUP(Table1[[#This Row],[Price Region]],PRICEREGIONLIST,4,FALSE)","v":false},{"$f":"VLOOKUP(Table1[[#This Row],[Price Region]],PRICEREGIONLIST,5,FALSE)","v":false}]
[null,"Kenya",110,"Africa",{"$f":"VLOOKUP(Table1[[#This Row],[Price Region]],PRICEREGIONLIST,2,FALSE)","v":"1"},{"$f":"VLOOKUP(Table1[[#This Row],[Price Region]],PRICEREGIONLIST,3,FALSE)","v":"USD"},{"$f":"IFERROR(VLOOKUP(Table1[[#This Row],[Country Name]],EXCOUNTRYLIST,1,FALSE)<>\"N/A\",\"FALSE\")","v":"FALSE"},{"$f":"VLOOKUP(Table1[[#This Row],[Price Region]],PRICEREGIONLIST,4,FALSE)","v":false},{"$f":"VLOOKUP(Table1[[#This Row],[Price Region]],PRICEREGIONLIST,5,FALSE)","v":false}]
[null,"Kiribati",111,"Australia",{"$f":"VLOOKUP(Table1[[#This Row],[Price Region]],PRICEREGIONLIST,2,FALSE)","v":3},{"$f":"VLOOKUP(Table1[[#This Row],[Price Region]],PRICEREGIONLIST,3,FALSE)","v":"AUD"},{"$f":"IFERROR(VLOOKUP(Table1[[#This Row],[Country Name]],EXCOUNTRYLIST,1,FALSE)<>\"N/A\",\"FALSE\")","v":"FALSE"},{"$f":"VLOOKUP(Table1[[#This Row],[Price Region]],PRICEREGIONLIST,4,FALSE)","v":false},{"$f":"VLOOKUP(Table1[[#This Row],[Price Region]],PRICEREGIONLIST,5,FALSE)","v":false}]
[null,"Korea, North",112,"South East Asia",{"$f":"VLOOKUP(Table1[[#This Row],[Price Region]],PRICEREGIONLIST,2,FALSE)","v":23},{"$f":"VLOOKUP(Table1[[#This Row],[Price Region]],PRICEREGIONLIST,3,FALSE)","v":"USD"},{"$f":"IFERROR(VLOOKUP(Table1[[#This Row],[Country Name]],EXCOUNTRYLIST,1,FALSE)<>\"N/A\",\"FALSE\")","v":true},{"$f":"VLOOKUP(Table1[[#This Row],[Price Region]],PRICEREGIONLIST,4,FALSE)","v":false},{"$f":"VLOOKUP(Table1[[#This Row],[Price Region]],PRICEREGIONLIST,5,FALSE)","v":false}]
[null,"Korea, South",113,"South East Asia",{"$f":"VLOOKUP(Table1[[#This Row],[Price Region]],PRICEREGIONLIST,2,FALSE)","v":23},{"$f":"VLOOKUP(Table1[[#This Row],[Price Region]],PRICEREGIONLIST,3,FALSE)","v":"USD"},{"$f":"IFERROR(VLOOKUP(Table1[[#This Row],[Country Name]],EXCOUNTRYLIST,1,FALSE)<>\"N/A\",\"FALSE\")","v":"FALSE"},{"$f":"VLOOKUP(Table1[[#This Row],[Price Region]],PRICEREGIONLIST,4,FALSE)","v":false},{"$f":"VLOOKUP(Table1[[#This Row],[Price Region]],PRICEREGIONLIST,5,FALSE)","v":false}]
[null,"Kuwait",114,"Middle East",{"$f":"VLOOKUP(Table1[[#This Row],[Price Region]],PRICEREGIONLIST,2,FALSE)","v":17},{"$f":"VLOOKUP(Table1[[#This Row],[Price Region]],PRICEREGIONLIST,3,FALSE)","v":"USD"},{"$f":"IFERROR(VLOOKUP(Table1[[#This Row],[Country Name]],EXCOUNTRYLIST,1,FALSE)<>\"N/A\",\"FALSE\")","v":"FALSE"},{"$f":"VLOOKUP(Table1[[#This Row],[Price Region]],PRICEREGIONLIST,4,FALSE)","v":false},{"$f":"VLOOKUP(Table1[[#This Row],[Price Region]],PRICEREGIONLIST,5,FALSE)","v":false}]
[null,"Kyrgyzstan",115,"Central Asia 1 - CEE 1",{"$f":"VLOOKUP(Table1[[#This Row],[Price Region]],PRICEREGIONLIST,2,FALSE)","v":5},{"$f":"VLOOKUP(Table1[[#This Row],[Price Region]],PRICEREGIONLIST,3,FALSE)","v":"USD"},{"$f":"IFERROR(VLOOKUP(Table1[[#This Row],[Country Name]],EXCOUNTRYLIST,1,FALSE)<>\"N/A\",\"FALSE\")","v":"FALSE"},{"$f":"VLOOKUP(Table1[[#This Row],[Price Region]],PRICEREGIONLIST,4,FALSE)","v":false},{"$f":"VLOOKUP(Table1[[#This Row],[Price Region]],PRICEREGIONLIST,5,FALSE)","v":false}]
[null,"Laos",116,"South East Asia",{"$f":"VLOOKUP(Table1[[#This Row],[Price Region]],PRICEREGIONLIST,2,FALSE)","v":23},{"$f":"VLOOKUP(Table1[[#This Row],[Price Region]],PRICEREGIONLIST,3,FALSE)","v":"USD"},{"$f":"IFERROR(VLOOKUP(Table1[[#This Row],[Country Name]],EXCOUNTRYLIST,1,FALSE)<>\"N/A\",\"FALSE\")","v":"FALSE"},{"$f":"VLOOKUP(Table1[[#This Row],[Price Region]],PRICEREGIONLIST,4,FALSE)","v":false},{"$f":"VLOOKUP(Table1[[#This Row],[Price Region]],PRICEREGIONLIST,5,FALSE)","v":false}]
[null,"Latvia",117,"Eurozone",{"$f":"VLOOKUP(Table1[[#This Row],[Price Region]],PRICEREGIONLIST,2,FALSE)","v":26},{"$f":"VLOOKUP(Table1[[#This Row],[Price Region]],PRICEREGIONLIST,3,FALSE)","v":"EUR"},{"$f":"IFERROR(VLOOKUP(Table1[[#This Row],[Country Name]],EXCOUNTRYLIST,1,FALSE)<>\"N/A\",\"FALSE\")","v":"FALSE"},{"$f":"VLOOKUP(Table1[[#This Row],[Price Region]],PRICEREGIONLIST,4,FALSE)","v":true},{"$f":"VLOOKUP(Table1[[#This Row],[Price Region]],PRICEREGIONLIST,5,FALSE)","v":false}]
[null,"Lebanon",118,"Middle East",{"$f":"VLOOKUP(Table1[[#This Row],[Price Region]],PRICEREGIONLIST,2,FALSE)","v":17},{"$f":"VLOOKUP(Table1[[#This Row],[Price Region]],PRICEREGIONLIST,3,FALSE)","v":"USD"},{"$f":"IFERROR(VLOOKUP(Table1[[#This Row],[Country Name]],EXCOUNTRYLIST,1,FALSE)<>\"N/A\",\"FALSE\")","v":"FALSE"},{"$f":"VLOOKUP(Table1[[#This Row],[Price Region]],PRICEREGIONLIST,4,FALSE)","v":false},{"$f":"VLOOKUP(Table1[[#This Row],[Price Region]],PRICEREGIONLIST,5,FALSE)","v":false}]
[null,"Lesotho",119,"Africa",{"$f":"VLOOKUP(Table1[[#This Row],[Price Region]],PRICEREGIONLIST,2,FALSE)","v":"1"},{"$f":"VLOOKUP(Table1[[#This Row],[Price Region]],PRICEREGIONLIST,3,FALSE)","v":"USD"},{"$f":"IFERROR(VLOOKUP(Table1[[#This Row],[Country Name]],EXCOUNTRYLIST,1,FALSE)<>\"N/A\",\"FALSE\")","v":"FALSE"},{"$f":"VLOOKUP(Table1[[#This Row],[Price Region]],PRICEREGIONLIST,4,FALSE)","v":false},{"$f":"VLOOKUP(Table1[[#This Row],[Price Region]],PRICEREGIONLIST,5,FALSE)","v":false}]
[null,"Liberia",120,"Africa",{"$f":"VLOOKUP(Table1[[#This Row],[Price Region]],PRICEREGIONLIST,2,FALSE)","v":"1"},{"$f":"VLOOKUP(Table1[[#This Row],[Price Region]],PRICEREGIONLIST,3,FALSE)","v":"USD"},{"$f":"IFERROR(VLOOKUP(Table1[[#This Row],[Country Name]],EXCOUNTRYLIST,1,FALSE)<>\"N/A\",\"FALSE\")","v":"FALSE"},{"$f":"VLOOKUP(Table1[[#This Row],[Price Region]],PRICEREGIONLIST,4,FALSE)","v":false},{"$f":"VLOOKUP(Table1[[#This Row],[Price Region]],PRICEREGIONLIST,5,FALSE)","v":false}]
[null,"Libya",121,"Africa",{"$f":"VLOOKUP(Table1[[#This Row],[Price Region]],PRICEREGIONLIST,2,FALSE)","v":"1"},{"$f":"VLOOKUP(Table1[[#This Row],[Price Region]],PRICEREGIONLIST,3,FALSE)","v":"USD"},{"$f":"IFERROR(VLOOKUP(Table1[[#This Row],[Country Name]],EXCOUNTRYLIST,1,FALSE)<>\"N/A\",\"FALSE\")","v":"FALSE"},{"$f":"VLOOKUP(Table1[[#This Row],[Price Region]],PRICEREGIONLIST,4,FALSE)","v":false},{"$f":"VLOOKUP(Table1[[#This Row],[Price Region]],PRICEREGIONLIST,5,FALSE)","v":false}]
[null,"Liechtenstein",122,"Switzerland2",{"$f":"VLOOKUP(Table1[[#This Row],[Price Region]],PRICEREGIONLIST,2,FALSE)","v":30},{"$f":"VLOOKUP(Table1[[#This Row],[Price Region]],PRICEREGIONLIST,3,FALSE)","v":"CHF"},{"$f":"IFERROR(VLOOKUP(Table1[[#This Row],[Country Name]],EXCOUNTRYLIST,1,FALSE)<>\"N/A\",\"FALSE\")","v":"FALSE"},{"$f":"VLOOKUP(Table1[[#This Row],[Price Region]],PRICEREGIONLIST,4,FALSE)","v":true},{"$f":"VLOOKUP(Table1[[#This Row],[Price Region]],PRICEREGIONLIST,5,FALSE)","v":true}]
[null,"Lithuania",123,"Eurozone",{"$f":"VLOOKUP(Table1[[#This Row],[Price Region]],PRICEREGIONLIST,2,FALSE)","v":26},{"$f":"VLOOKUP(Table1[[#This Row],[Price Region]],PRICEREGIONLIST,3,FALSE)","v":"EUR"},{"$f":"IFERROR(VLOOKUP(Table1[[#This Row],[Country Name]],EXCOUNTRYLIST,1,FALSE)<>\"N/A\",\"FALSE\")","v":"FALSE"},{"$f":"VLOOKUP(Table1[[#This Row],[Price Region]],PRICEREGIONLIST,4,FALSE)","v":true},{"$f":"VLOOKUP(Table1[[#This Row],[Price Region]],PRICEREGIONLIST,5,FALSE)","v":false}]
[null,"Luxembourg",124,"Eurozone",{"$f":"VLOOKUP(Table1[[#This Row],[Price Region]],PRICEREGIONLIST,2,FALSE)","v":26},{"$f":"VLOOKUP(Table1[[#This Row],[Price Region]],PRICEREGIONLIST,3,FALSE)","v":"EUR"},{"$f":"IFERROR(VLOOKUP(Table1[[#This Row],[Country Name]],EXCOUNTRYLIST,1,FALSE)<>\"N/A\",\"FALSE\")","v":"FALSE"},{"$f":"VLOOKUP(Table1[[#This Row],[Price Region]],PRICEREGIONLIST,4,FALSE)","v":true},{"$f":"VLOOKUP(Table1[[#This Row],[Price Region]],PRICEREGIONLIST,5,FALSE)","v":false}]
[null,"Macao SAR",125,"South East Asia",{"$f":"VLOOKUP(Table1[[#This Row],[Price Region]],PRICEREGIONLIST,2,FALSE)","v":23},{"$f":"VLOOKUP(Table1[[#This Row],[Price Region]],PRICEREGIONLIST,3,FALSE)","v":"USD"},{"$f":"IFERROR(VLOOKUP(Table1[[#This Row],[Country Name]],EXCOUNTRYLIST,1,FALSE)<>\"N/A\",\"FALSE\")","v":"FALSE"},{"$f":"VLOOKUP(Table1[[#This Row],[Price Region]],PRICEREGIONLIST,4,FALSE)","v":false},{"$f":"VLOOKUP(Table1[[#This Row],[Price Region]],PRICEREGIONLIST,5,FALSE)","v":false}]
[null,"Macedonia",126,"Eastern Europe 1",{"$f":"VLOOKUP(Table1[[#This Row],[Price Region]],PRICEREGIONLIST,2,FALSE)","v":10},{"$f":"VLOOKUP(Table1[[#This Row],[Price Region]],PRICEREGIONLIST,3,FALSE)","v":"USD"},{"$f":"IFERROR(VLOOKUP(Table1[[#This Row],[Country Name]],EXCOUNTRYLIST,1,FALSE)<>\"N/A\",\"FALSE\")","v":"FALSE"},{"$f":"VLOOKUP(Table1[[#This Row],[Price Region]],PRICEREGIONLIST,4,FALSE)","v":false},{"$f":"VLOOKUP(Table1[[#This Row],[Price Region]],PRICEREGIONLIST,5,FALSE)","v":false}]
[null,"Madagascar",127,"Africa",{"$f":"VLOOKUP(Table1[[#This Row],[Price Region]],PRICEREGIONLIST,2,FALSE)","v":"1"},{"$f":"VLOOKUP(Table1[[#This Row],[Price Region]],PRICEREGIONLIST,3,FALSE)","v":"USD"},{"$f":"IFERROR(VLOOKUP(Table1[[#This Row],[Country Name]],EXCOUNTRYLIST,1,FALSE)<>\"N/A\",\"FALSE\")","v":"FALSE"},{"$f":"VLOOKUP(Table1[[#This Row],[Price Region]],PRICEREGIONLIST,4,FALSE)","v":false},{"$f":"VLOOKUP(Table1[[#This Row],[Price Region]],PRICEREGIONLIST,5,FALSE)","v":false}]
[null,"Malawi",128,"Africa",{"$f":"VLOOKUP(Table1[[#This Row],[Price Region]],PRICEREGIONLIST,2,FALSE)","v":"1"},{"$f":"VLOOKUP(Table1[[#This Row],[Price Region]],PRICEREGIONLIST,3,FALSE)","v":"USD"},{"$f":"IFERROR(VLOOKUP(Table1[[#This Row],[Country Name]],EXCOUNTRYLIST,1,FALSE)<>\"N/A\",\"FALSE\")","v":"FALSE"},{"$f":"VLOOKUP(Table1[[#This Row],[Price Region]],PRICEREGIONLIST,4,FALSE)","v":false},{"$f":"VLOOKUP(Table1[[#This Row],[Price Region]],PRICEREGIONLIST,5,FALSE)","v":false}]
[null,"Malaysia",129,"South East Asia",{"$f":"VLOOKUP(Table1[[#This Row],[Price Region]],PRICEREGIONLIST,2,FALSE)","v":23},{"$f":"VLOOKUP(Table1[[#This Row],[Price Region]],PRICEREGIONLIST,3,FALSE)","v":"USD"},{"$f":"IFERROR(VLOOKUP(Table1[[#This Row],[Country Name]],EXCOUNTRYLIST,1,FALSE)<>\"N/A\",\"FALSE\")","v":"FALSE"},{"$f":"VLOOKUP(Table1[[#This Row],[Price Region]],PRICEREGIONLIST,4,FALSE)","v":false},{"$f":"VLOOKUP(Table1[[#This Row],[Price Region]],PRICEREGIONLIST,5,FALSE)","v":false}]
[null,"Maldives",130,"South East Asia",{"$f":"VLOOKUP(Table1[[#This Row],[Price Region]],PRICEREGIONLIST,2,FALSE)","v":23},{"$f":"VLOOKUP(Table1[[#This Row],[Price Region]],PRICEREGIONLIST,3,FALSE)","v":"USD"},{"$f":"IFERROR(VLOOKUP(Table1[[#This Row],[Country Name]],EXCOUNTRYLIST,1,FALSE)<>\"N/A\",\"FALSE\")","v":"FALSE"},{"$f":"VLOOKUP(Table1[[#This Row],[Price Region]],PRICEREGIONLIST,4,FALSE)","v":false},{"$f":"VLOOKUP(Table1[[#This Row],[Price Region]],PRICEREGIONLIST,5,FALSE)","v":false}]
[null,"Mali",131,"Africa",{"$f":"VLOOKUP(Table1[[#This Row],[Price Region]],PRICEREGIONLIST,2,FALSE)","v":"1"},{"$f":"VLOOKUP(Table1[[#This Row],[Price Region]],PRICEREGIONLIST,3,FALSE)","v":"USD"},{"$f":"IFERROR(VLOOKUP(Table1[[#This Row],[Country Name]],EXCOUNTRYLIST,1,FALSE)<>\"N/A\",\"FALSE\")","v":"FALSE"},{"$f":"VLOOKUP(Table1[[#This Row],[Price Region]],PRICEREGIONLIST,4,FALSE)","v":false},{"$f":"VLOOKUP(Table1[[#This Row],[Price Region]],PRICEREGIONLIST,5,FALSE)","v":false}]
[null,"Malta",132,"Eurozone",{"$f":"VLOOKUP(Table1[[#This Row],[Price Region]],PRICEREGIONLIST,2,FALSE)","v":26},{"$f":"VLOOKUP(Table1[[#This Row],[Price Region]],PRICEREGIONLIST,3,FALSE)","v":"EUR"},{"$f":"IFERROR(VLOOKUP(Table1[[#This Row],[Country Name]],EXCOUNTRYLIST,1,FALSE)<>\"N/A\",\"FALSE\")","v":"FALSE"},{"$f":"VLOOKUP(Table1[[#This Row],[Price Region]],PRICEREGIONLIST,4,FALSE)","v":true},{"$f":"VLOOKUP(Table1[[#This Row],[Price Region]],PRICEREGIONLIST,5,FALSE)","v":false}]
[null,"Marshall Islands",133,"APOC United States",{"$f":"VLOOKUP(Table1[[#This Row],[Price Region]],PRICEREGIONLIST,2,FALSE)","v":2},{"$f":"VLOOKUP(Table1[[#This Row],[Price Region]],PRICEREGIONLIST,3,FALSE)","v":"USD"},{"$f":"IFERROR(VLOOKUP(Table1[[#This Row],[Country Name]],EXCOUNTRYLIST,1,FALSE)<>\"N/A\",\"FALSE\")","v":"FALSE"},{"$f":"VLOOKUP(Table1[[#This Row],[Price Region]],PRICEREGIONLIST,4,FALSE)","v":false},{"$f":"VLOOKUP(Table1[[#This Row],[Price Region]],PRICEREGIONLIST,5,FALSE)","v":false}]
[null,"Martinique",134,"Eurozone",{"$f":"VLOOKUP(Table1[[#This Row],[Price Region]],PRICEREGIONLIST,2,FALSE)","v":26},{"$f":"VLOOKUP(Table1[[#This Row],[Price Region]],PRICEREGIONLIST,3,FALSE)","v":"EUR"},{"$f":"IFERROR(VLOOKUP(Table1[[#This Row],[Country Name]],EXCOUNTRYLIST,1,FALSE)<>\"N/A\",\"FALSE\")","v":"FALSE"},{"$f":"VLOOKUP(Table1[[#This Row],[Price Region]],PRICEREGIONLIST,4,FALSE)","v":true},{"$f":"VLOOKUP(Table1[[#This Row],[Price Region]],PRICEREGIONLIST,5,FALSE)","v":false}]
[null,"Mauritania",135,"Africa",{"$f":"VLOOKUP(Table1[[#This Row],[Price Region]],PRICEREGIONLIST,2,FALSE)","v":"1"},{"$f":"VLOOKUP(Table1[[#This Row],[Price Region]],PRICEREGIONLIST,3,FALSE)","v":"USD"},{"$f":"IFERROR(VLOOKUP(Table1[[#This Row],[Country Name]],EXCOUNTRYLIST,1,FALSE)<>\"N/A\",\"FALSE\")","v":"FALSE"},{"$f":"VLOOKUP(Table1[[#This Row],[Price Region]],PRICEREGIONLIST,4,FALSE)","v":false},{"$f":"VLOOKUP(Table1[[#This Row],[Price Region]],PRICEREGIONLIST,5,FALSE)","v":false}]
[null,"Mauritius",136,"Africa",{"$f":"VLOOKUP(Table1[[#This Row],[Price Region]],PRICEREGIONLIST,2,FALSE)","v":"1"},{"$f":"VLOOKUP(Table1[[#This Row],[Price Region]],PRICEREGIONLIST,3,FALSE)","v":"USD"},{"$f":"IFERROR(VLOOKUP(Table1[[#This Row],[Country Name]],EXCOUNTRYLIST,1,FALSE)<>\"N/A\",\"FALSE\")","v":"FALSE"},{"$f":"VLOOKUP(Table1[[#This Row],[Price Region]],PRICEREGIONLIST,4,FALSE)","v":false},{"$f":"VLOOKUP(Table1[[#This Row],[Price Region]],PRICEREGIONLIST,5,FALSE)","v":false}]
[null,"Mayotte",137,"Eurozone",{"$f":"VLOOKUP(Table1[[#This Row],[Price Region]],PRICEREGIONLIST,2,FALSE)","v":26},{"$f":"VLOOKUP(Table1[[#This Row],[Price Region]],PRICEREGIONLIST,3,FALSE)","v":"EUR"},{"$f":"IFERROR(VLOOKUP(Table1[[#This Row],[Country Name]],EXCOUNTRYLIST,1,FALSE)<>\"N/A\",\"FALSE\")","v":"FALSE"},{"$f":"VLOOKUP(Table1[[#This Row],[Price Region]],PRICEREGIONLIST,4,FALSE)","v":true},{"$f":"VLOOKUP(Table1[[#This Row],[Price Region]],PRICEREGIONLIST,5,FALSE)","v":false}]
[null,"Mexico",138,"Mexico",{"$f":"VLOOKUP(Table1[[#This Row],[Price Region]],PRICEREGIONLIST,2,FALSE)","v":16},{"$f":"VLOOKUP(Table1[[#This Row],[Price Region]],PRICEREGIONLIST,3,FALSE)","v":"USD"},{"$f":"IFERROR(VLOOKUP(Table1[[#This Row],[Country Name]],EXCOUNTRYLIST,1,FALSE)<>\"N/A\",\"FALSE\")","v":"FALSE"},{"$f":"VLOOKUP(Table1[[#This Row],[Price Region]],PRICEREGIONLIST,4,FALSE)","v":false},{"$f":"VLOOKUP(Table1[[#This Row],[Price Region]],PRICEREGIONLIST,5,FALSE)","v":false}]
[null,"Micronesia",139,"South East Asia",{"$f":"VLOOKUP(Table1[[#This Row],[Price Region]],PRICEREGIONLIST,2,FALSE)","v":23},{"$f":"VLOOKUP(Table1[[#This Row],[Price Region]],PRICEREGIONLIST,3,FALSE)","v":"USD"},{"$f":"IFERROR(VLOOKUP(Table1[[#This Row],[Country Name]],EXCOUNTRYLIST,1,FALSE)<>\"N/A\",\"FALSE\")","v":"FALSE"},{"$f":"VLOOKUP(Table1[[#This Row],[Price Region]],PRICEREGIONLIST,4,FALSE)","v":false},{"$f":"VLOOKUP(Table1[[#This Row],[Price Region]],PRICEREGIONLIST,5,FALSE)","v":false}]
[null,"Moldova",140,"Eastern Europe 2",{"$f":"VLOOKUP(Table1[[#This Row],[Price Region]],PRICEREGIONLIST,2,FALSE)","v":11},{"$f":"VLOOKUP(Table1[[#This Row],[Price Region]],PRICEREGIONLIST,3,FALSE)","v":"USD"},{"$f":"IFERROR(VLOOKUP(Table1[[#This Row],[Country Name]],EXCOUNTRYLIST,1,FALSE)<>\"N/A\",\"FALSE\")","v":"FALSE"},{"$f":"VLOOKUP(Table1[[#This Row],[Price Region]],PRICEREGIONLIST,4,FALSE)","v":false},{"$f":"VLOOKUP(Table1[[#This Row],[Price Region]],PRICEREGIONLIST,5,FALSE)","v":false}]
[null,"Monaco",141,"Eurozone",{"$f":"VLOOKUP(Table1[[#This Row],[Price Region]],PRICEREGIONLIST,2,FALSE)","v":26},{"$f":"VLOOKUP(Table1[[#This Row],[Price Region]],PRICEREGIONLIST,3,FALSE)","v":"EUR"},{"$f":"IFERROR(VLOOKUP(Table1[[#This Row],[Country Name]],EXCOUNTRYLIST,1,FALSE)<>\"N/A\",\"FALSE\")","v":"FALSE"},{"$f":"VLOOKUP(Table1[[#This Row],[Price Region]],PRICEREGIONLIST,4,FALSE)","v":true},{"$f":"VLOOKUP(Table1[[#This Row],[Price Region]],PRICEREGIONLIST,5,FALSE)","v":false}]
[null,"Mongolia",142,"Central Asia 1 - CEE 1",{"$f":"VLOOKUP(Table1[[#This Row],[Price Region]],PRICEREGIONLIST,2,FALSE)","v":5},{"$f":"VLOOKUP(Table1[[#This Row],[Price Region]],PRICEREGIONLIST,3,FALSE)","v":"USD"},{"$f":"IFERROR(VLOOKUP(Table1[[#This Row],[Country Name]],EXCOUNTRYLIST,1,FALSE)<>\"N/A\",\"FALSE\")","v":"FALSE"},{"$f":"VLOOKUP(Table1[[#This Row],[Price Region]],PRICEREGIONLIST,4,FALSE)","v":false},{"$f":"VLOOKUP(Table1[[#This Row],[Price Region]],PRICEREGIONLIST,5,FALSE)","v":false}]
[null,"Montenegro",143,"Eastern Europe 1",{"$f":"VLOOKUP(Table1[[#This Row],[Price Region]],PRICEREGIONLIST,2,FALSE)","v":10},{"$f":"VLOOKUP(Table1[[#This Row],[Price Region]],PRICEREGIONLIST,3,FALSE)","v":"USD"},{"$f":"IFERROR(VLOOKUP(Table1[[#This Row],[Country Name]],EXCOUNTRYLIST,1,FALSE)<>\"N/A\",\"FALSE\")","v":"FALSE"},{"$f":"VLOOKUP(Table1[[#This Row],[Price Region]],PRICEREGIONLIST,4,FALSE)","v":false},{"$f":"VLOOKUP(Table1[[#This Row],[Price Region]],PRICEREGIONLIST,5,FALSE)","v":false}]
[null,"Montserrat",144,"Latam Caribbean",{"$f":"VLOOKUP(Table1[[#This Row],[Price Region]],PRICEREGIONLIST,2,FALSE)","v":14},{"$f":"VLOOKUP(Table1[[#This Row],[Price Region]],PRICEREGIONLIST,3,FALSE)","v":"USD"},{"$f":"IFERROR(VLOOKUP(Table1[[#This Row],[Country Name]],EXCOUNTRYLIST,1,FALSE)<>\"N/A\",\"FALSE\")","v":"FALSE"},{"$f":"VLOOKUP(Table1[[#This Row],[Price Region]],PRICEREGIONLIST,4,FALSE)","v":false},{"$f":"VLOOKUP(Table1[[#This Row],[Price Region]],PRICEREGIONLIST,5,FALSE)","v":false}]
[null,"Morocco",145,"Africa",{"$f":"VLOOKUP(Table1[[#This Row],[Price Region]],PRICEREGIONLIST,2,FALSE)","v":"1"},{"$f":"VLOOKUP(Table1[[#This Row],[Price Region]],PRICEREGIONLIST,3,FALSE)","v":"USD"},{"$f":"IFERROR(VLOOKUP(Table1[[#This Row],[Country Name]],EXCOUNTRYLIST,1,FALSE)<>\"N/A\",\"FALSE\")","v":"FALSE"},{"$f":"VLOOKUP(Table1[[#This Row],[Price Region]],PRICEREGIONLIST,4,FALSE)","v":false},{"$f":"VLOOKUP(Table1[[#This Row],[Price Region]],PRICEREGIONLIST,5,FALSE)","v":false}]
[null,"Mozambique",146,"Africa",{"$f":"VLOOKUP(Table1[[#This Row],[Price Region]],PRICEREGIONLIST,2,FALSE)","v":"1"},{"$f":"VLOOKUP(Table1[[#This Row],[Price Region]],PRICEREGIONLIST,3,FALSE)","v":"USD"},{"$f":"IFERROR(VLOOKUP(Table1[[#This Row],[Country Name]],EXCOUNTRYLIST,1,FALSE)<>\"N/A\",\"FALSE\")","v":"FALSE"},{"$f":"VLOOKUP(Table1[[#This Row],[Price Region]],PRICEREGIONLIST,4,FALSE)","v":false},{"$f":"VLOOKUP(Table1[[#This Row],[Price Region]],PRICEREGIONLIST,5,FALSE)","v":false}]
[null,"Myanmar",147,"South East Asia",{"$f":"VLOOKUP(Table1[[#This Row],[Price Region]],PRICEREGIONLIST,2,FALSE)","v":23},{"$f":"VLOOKUP(Table1[[#This Row],[Price Region]],PRICEREGIONLIST,3,FALSE)","v":"USD"},{"$f":"IFERROR(VLOOKUP(Table1[[#This Row],[Country Name]],EXCOUNTRYLIST,1,FALSE)<>\"N/A\",\"FALSE\")","v":"FALSE"},{"$f":"VLOOKUP(Table1[[#This Row],[Price Region]],PRICEREGIONLIST,4,FALSE)","v":false},{"$f":"VLOOKUP(Table1[[#This Row],[Price Region]],PRICEREGIONLIST,5,FALSE)","v":false}]
[null,"Namibia",148,"Africa",{"$f":"VLOOKUP(Table1[[#This Row],[Price Region]],PRICEREGIONLIST,2,FALSE)","v":"1"},{"$f":"VLOOKUP(Table1[[#This Row],[Price Region]],PRICEREGIONLIST,3,FALSE)","v":"USD"},{"$f":"IFERROR(VLOOKUP(Table1[[#This Row],[Country Name]],EXCOUNTRYLIST,1,FALSE)<>\"N/A\",\"FALSE\")","v":"FALSE"},{"$f":"VLOOKUP(Table1[[#This Row],[Price Region]],PRICEREGIONLIST,4,FALSE)","v":false},{"$f":"VLOOKUP(Table1[[#This Row],[Price Region]],PRICEREGIONLIST,5,FALSE)","v":false}]
[null,"Nauru",149,"Australia",{"$f":"VLOOKUP(Table1[[#This Row],[Price Region]],PRICEREGIONLIST,2,FALSE)","v":3},{"$f":"VLOOKUP(Table1[[#This Row],[Price Region]],PRICEREGIONLIST,3,FALSE)","v":"AUD"},{"$f":"IFERROR(VLOOKUP(Table1[[#This Row],[Country Name]],EXCOUNTRYLIST,1,FALSE)<>\"N/A\",\"FALSE\")","v":"FALSE"},{"$f":"VLOOKUP(Table1[[#This Row],[Price Region]],PRICEREGIONLIST,4,FALSE)","v":false},{"$f":"VLOOKUP(Table1[[#This Row],[Price Region]],PRICEREGIONLIST,5,FALSE)","v":false}]
[null,"Nepal",150,"South East Asia",{"$f":"VLOOKUP(Table1[[#This Row],[Price Region]],PRICEREGIONLIST,2,FALSE)","v":23},{"$f":"VLOOKUP(Table1[[#This Row],[Price Region]],PRICEREGIONLIST,3,FALSE)","v":"USD"},{"$f":"IFERROR(VLOOKUP(Table1[[#This Row],[Country Name]],EXCOUNTRYLIST,1,FALSE)<>\"N/A\",\"FALSE\")","v":"FALSE"},{"$f":"VLOOKUP(Table1[[#This Row],[Price Region]],PRICEREGIONLIST,4,FALSE)","v":false},{"$f":"VLOOKUP(Table1[[#This Row],[Price Region]],PRICEREGIONLIST,5,FALSE)","v":false}]
[null,"Netherlands Antilles",151,"Latam Caribbean",{"$f":"VLOOKUP(Table1[[#This Row],[Price Region]],PRICEREGIONLIST,2,FALSE)","v":14},{"$f":"VLOOKUP(Table1[[#This Row],[Price Region]],PRICEREGIONLIST,3,FALSE)","v":"USD"},{"$f":"IFERROR(VLOOKUP(Table1[[#This Row],[Country Name]],EXCOUNTRYLIST,1,FALSE)<>\"N/A\",\"FALSE\")","v":"FALSE"},{"$f":"VLOOKUP(Table1[[#This Row],[Price Region]],PRICEREGIONLIST,4,FALSE)","v":false},{"$f":"VLOOKUP(Table1[[#This Row],[Price Region]],PRICEREGIONLIST,5,FALSE)","v":false}]
[null,"Netherlands, The",152,"Eurozone",{"$f":"VLOOKUP(Table1[[#This Row],[Price Region]],PRICEREGIONLIST,2,FALSE)","v":26},{"$f":"VLOOKUP(Table1[[#This Row],[Price Region]],PRICEREGIONLIST,3,FALSE)","v":"EUR"},{"$f":"IFERROR(VLOOKUP(Table1[[#This Row],[Country Name]],EXCOUNTRYLIST,1,FALSE)<>\"N/A\",\"FALSE\")","v":"FALSE"},{"$f":"VLOOKUP(Table1[[#This Row],[Price Region]],PRICEREGIONLIST,4,FALSE)","v":true},{"$f":"VLOOKUP(Table1[[#This Row],[Price Region]],PRICEREGIONLIST,5,FALSE)","v":false}]
[null,"New Caledonia",153,"Africa",{"$f":"VLOOKUP(Table1[[#This Row],[Price Region]],PRICEREGIONLIST,2,FALSE)","v":"1"},{"$f":"VLOOKUP(Table1[[#This Row],[Price Region]],PRICEREGIONLIST,3,FALSE)","v":"USD"},{"$f":"IFERROR(VLOOKUP(Table1[[#This Row],[Country Name]],EXCOUNTRYLIST,1,FALSE)<>\"N/A\",\"FALSE\")","v":"FALSE"},{"$f":"VLOOKUP(Table1[[#This Row],[Price Region]],PRICEREGIONLIST,4,FALSE)","v":false},{"$f":"VLOOKUP(Table1[[#This Row],[Price Region]],PRICEREGIONLIST,5,FALSE)","v":false}]
[null,"New Zealand",154,"New Zealand",{"$f":"VLOOKUP(Table1[[#This Row],[Price Region]],PRICEREGIONLIST,2,FALSE)","v":18},{"$f":"VLOOKUP(Table1[[#This Row],[Price Region]],PRICEREGIONLIST,3,FALSE)","v":"NZD"},{"$f":"IFERROR(VLOOKUP(Table1[[#This Row],[Country Name]],EXCOUNTRYLIST,1,FALSE)<>\"N/A\",\"FALSE\")","v":"FALSE"},{"$f":"VLOOKUP(Table1[[#This Row],[Price Region]],PRICEREGIONLIST,4,FALSE)","v":false},{"$f":"VLOOKUP(Table1[[#This Row],[Price Region]],PRICEREGIONLIST,5,FALSE)","v":false}]
[null,"Nicaragua",155,"Rest of Latam",{"$f":"VLOOKUP(Table1[[#This Row],[Price Region]],PRICEREGIONLIST,2,FALSE)","v":19},{"$f":"VLOOKUP(Table1[[#This Row],[Price Region]],PRICEREGIONLIST,3,FALSE)","v":"USD"},{"$f":"IFERROR(VLOOKUP(Table1[[#This Row],[Country Name]],EXCOUNTRYLIST,1,FALSE)<>\"N/A\",\"FALSE\")","v":"FALSE"},{"$f":"VLOOKUP(Table1[[#This Row],[Price Region]],PRICEREGIONLIST,4,FALSE)","v":false},{"$f":"VLOOKUP(Table1[[#This Row],[Price Region]],PRICEREGIONLIST,5,FALSE)","v":false}]
[null,"Niger",156,"Africa",{"$f":"VLOOKUP(Table1[[#This Row],[Price Region]],PRICEREGIONLIST,2,FALSE)","v":"1"},{"$f":"VLOOKUP(Table1[[#This Row],[Price Region]],PRICEREGIONLIST,3,FALSE)","v":"USD"},{"$f":"IFERROR(VLOOKUP(Table1[[#This Row],[Country Name]],EXCOUNTRYLIST,1,FALSE)<>\"N/A\",\"FALSE\")","v":"FALSE"},{"$f":"VLOOKUP(Table1[[#This Row],[Price Region]],PRICEREGIONLIST,4,FALSE)","v":false},{"$f":"VLOOKUP(Table1[[#This Row],[Price Region]],PRICEREGIONLIST,5,FALSE)","v":false}]
[null,"Nigeria",157,"Africa",{"$f":"VLOOKUP(Table1[[#This Row],[Price Region]],PRICEREGIONLIST,2,FALSE)","v":"1"},{"$f":"VLOOKUP(Table1[[#This Row],[Price Region]],PRICEREGIONLIST,3,FALSE)","v":"USD"},{"$f":"IFERROR(VLOOKUP(Table1[[#This Row],[Country Name]],EXCOUNTRYLIST,1,FALSE)<>\"N/A\",\"FALSE\")","v":"FALSE"},{"$f":"VLOOKUP(Table1[[#This Row],[Price Region]],PRICEREGIONLIST,4,FALSE)","v":false},{"$f":"VLOOKUP(Table1[[#This Row],[Price Region]],PRICEREGIONLIST,5,FALSE)","v":false}]
[null,"Niue",158,"New Zealand",{"$f":"VLOOKUP(Table1[[#This Row],[Price Region]],PRICEREGIONLIST,2,FALSE)","v":18},{"$f":"VLOOKUP(Table1[[#This Row],[Price Region]],PRICEREGIONLIST,3,FALSE)","v":"NZD"},{"$f":"IFERROR(VLOOKUP(Table1[[#This Row],[Country Name]],EXCOUNTRYLIST,1,FALSE)<>\"N/A\",\"FALSE\")","v":"FALSE"},{"$f":"VLOOKUP(Table1[[#This Row],[Price Region]],PRICEREGIONLIST,4,FALSE)","v":false},{"$f":"VLOOKUP(Table1[[#This Row],[Price Region]],PRICEREGIONLIST,5,FALSE)","v":false}]
[null,"Norfolk Island",159,"Australia",{"$f":"VLOOKUP(Table1[[#This Row],[Price Region]],PRICEREGIONLIST,2,FALSE)","v":3},{"$f":"VLOOKUP(Table1[[#This Row],[Price Region]],PRICEREGIONLIST,3,FALSE)","v":"AUD"},{"$f":"IFERROR(VLOOKUP(Table1[[#This Row],[Country Name]],EXCOUNTRYLIST,1,FALSE)<>\"N/A\",\"FALSE\")","v":"FALSE"},{"$f":"VLOOKUP(Table1[[#This Row],[Price Region]],PRICEREGIONLIST,4,FALSE)","v":false},{"$f":"VLOOKUP(Table1[[#This Row],[Price Region]],PRICEREGIONLIST,5,FALSE)","v":false}]
[null,"Northern Mariana Islands",160,"APOC United States",{"$f":"VLOOKUP(Table1[[#This Row],[Price Region]],PRICEREGIONLIST,2,FALSE)","v":2},{"$f":"VLOOKUP(Table1[[#This Row],[Price Region]],PRICEREGIONLIST,3,FALSE)","v":"USD"},{"$f":"IFERROR(VLOOKUP(Table1[[#This Row],[Country Name]],EXCOUNTRYLIST,1,FALSE)<>\"N/A\",\"FALSE\")","v":"FALSE"},{"$f":"VLOOKUP(Table1[[#This Row],[Price Region]],PRICEREGIONLIST,4,FALSE)","v":false},{"$f":"VLOOKUP(Table1[[#This Row],[Price Region]],PRICEREGIONLIST,5,FALSE)","v":false}]
[null,"Norway",161,"Norway2",{"$f":"VLOOKUP(Table1[[#This Row],[Price Region]],PRICEREGIONLIST,2,FALSE)","v":28},{"$f":"VLOOKUP(Table1[[#This Row],[Price Region]],PRICEREGIONLIST,3,FALSE)","v":"NOK"},{"$f":"IFERROR(VLOOKUP(Table1[[#This Row],[Country Name]],EXCOUNTRYLIST,1,FALSE)<>\"N/A\",\"FALSE\")","v":"FALSE"},{"$f":"VLOOKUP(Table1[[#This Row],[Price Region]],PRICEREGIONLIST,4,FALSE)","v":true},{"$f":"VLOOKUP(Table1[[#This Row],[Price Region]],PRICEREGIONLIST,5,FALSE)","v":true}]
[null,"Oman",162,"Middle East",{"$f":"VLOOKUP(Table1[[#This Row],[Price Region]],PRICEREGIONLIST,2,FALSE)","v":17},{"$f":"VLOOKUP(Table1[[#This Row],[Price Region]],PRICEREGIONLIST,3,FALSE)","v":"USD"},{"$f":"IFERROR(VLOOKUP(Table1[[#This Row],[Country Name]],EXCOUNTRYLIST,1,FALSE)<>\"N/A\",\"FALSE\")","v":"FALSE"},{"$f":"VLOOKUP(Table1[[#This Row],[Price Region]],PRICEREGIONLIST,4,FALSE)","v":false},{"$f":"VLOOKUP(Table1[[#This Row],[Price Region]],PRICEREGIONLIST,5,FALSE)","v":false}]
[null,"Pakistan",163,"Central Asia 1 - CEE 1",{"$f":"VLOOKUP(Table1[[#This Row],[Price Region]],PRICEREGIONLIST,2,FALSE)","v":5},{"$f":"VLOOKUP(Table1[[#This Row],[Price Region]],PRICEREGIONLIST,3,FALSE)","v":"USD"},{"$f":"IFERROR(VLOOKUP(Table1[[#This Row],[Country Name]],EXCOUNTRYLIST,1,FALSE)<>\"N/A\",\"FALSE\")","v":"FALSE"},{"$f":"VLOOKUP(Table1[[#This Row],[Price Region]],PRICEREGIONLIST,4,FALSE)","v":false},{"$f":"VLOOKUP(Table1[[#This Row],[Price Region]],PRICEREGIONLIST,5,FALSE)","v":false}]
[null,"Palau",164,"South East Asia",{"$f":"VLOOKUP(Table1[[#This Row],[Price Region]],PRICEREGIONLIST,2,FALSE)","v":23},{"$f":"VLOOKUP(Table1[[#This Row],[Price Region]],PRICEREGIONLIST,3,FALSE)","v":"USD"},{"$f":"IFERROR(VLOOKUP(Table1[[#This Row],[Country Name]],EXCOUNTRYLIST,1,FALSE)<>\"N/A\",\"FALSE\")","v":"FALSE"},{"$f":"VLOOKUP(Table1[[#This Row],[Price Region]],PRICEREGIONLIST,4,FALSE)","v":false},{"$f":"VLOOKUP(Table1[[#This Row],[Price Region]],PRICEREGIONLIST,5,FALSE)","v":false}]
[null,"Palestinian Authority",79,"Middle East",{"$f":"VLOOKUP(Table1[[#This Row],[Price Region]],PRICEREGIONLIST,2,FALSE)","v":17},{"$f":"VLOOKUP(Table1[[#This Row],[Price Region]],PRICEREGIONLIST,3,FALSE)","v":"USD"},{"$f":"IFERROR(VLOOKUP(Table1[[#This Row],[Country Name]],EXCOUNTRYLIST,1,FALSE)<>\"N/A\",\"FALSE\")","v":"FALSE"},{"$f":"VLOOKUP(Table1[[#This Row],[Price Region]],PRICEREGIONLIST,4,FALSE)","v":false},{"$f":"VLOOKUP(Table1[[#This Row],[Price Region]],PRICEREGIONLIST,5,FALSE)","v":false}]
[null,"Panama",165,"Rest of Latam",{"$f":"VLOOKUP(Table1[[#This Row],[Price Region]],PRICEREGIONLIST,2,FALSE)","v":19},{"$f":"VLOOKUP(Table1[[#This Row],[Price Region]],PRICEREGIONLIST,3,FALSE)","v":"USD"},{"$f":"IFERROR(VLOOKUP(Table1[[#This Row],[Country Name]],EXCOUNTRYLIST,1,FALSE)<>\"N/A\",\"FALSE\")","v":"FALSE"},{"$f":"VLOOKUP(Table1[[#This Row],[Price Region]],PRICEREGIONLIST,4,FALSE)","v":false},{"$f":"VLOOKUP(Table1[[#This Row],[Price Region]],PRICEREGIONLIST,5,FALSE)","v":false}]
[null,"Papua New Guinea",166,"South East Asia",{"$f":"VLOOKUP(Table1[[#This Row],[Price Region]],PRICEREGIONLIST,2,FALSE)","v":23},{"$f":"VLOOKUP(Table1[[#This Row],[Price Region]],PRICEREGIONLIST,3,FALSE)","v":"USD"},{"$f":"IFERROR(VLOOKUP(Table1[[#This Row],[Country Name]],EXCOUNTRYLIST,1,FALSE)<>\"N/A\",\"FALSE\")","v":"FALSE"},{"$f":"VLOOKUP(Table1[[#This Row],[Price Region]],PRICEREGIONLIST,4,FALSE)","v":false},{"$f":"VLOOKUP(Table1[[#This Row],[Price Region]],PRICEREGIONLIST,5,FALSE)","v":false}]
[null,"Paraguay",167,"Rest of Latam",{"$f":"VLOOKUP(Table1[[#This Row],[Price Region]],PRICEREGIONLIST,2,FALSE)","v":19},{"$f":"VLOOKUP(Table1[[#This Row],[Price Region]],PRICEREGIONLIST,3,FALSE)","v":"USD"},{"$f":"IFERROR(VLOOKUP(Table1[[#This Row],[Country Name]],EXCOUNTRYLIST,1,FALSE)<>\"N/A\",\"FALSE\")","v":"FALSE"},{"$f":"VLOOKUP(Table1[[#This Row],[Price Region]],PRICEREGIONLIST,4,FALSE)","v":false},{"$f":"VLOOKUP(Table1[[#This Row],[Price Region]],PRICEREGIONLIST,5,FALSE)","v":false}]
[null,"Peru",168,"Rest of Latam",{"$f":"VLOOKUP(Table1[[#This Row],[Price Region]],PRICEREGIONLIST,2,FALSE)","v":19},{"$f":"VLOOKUP(Table1[[#This Row],[Price Region]],PRICEREGIONLIST,3,FALSE)","v":"USD"},{"$f":"IFERROR(VLOOKUP(Table1[[#This Row],[Country Name]],EXCOUNTRYLIST,1,FALSE)<>\"N/A\",\"FALSE\")","v":"FALSE"},{"$f":"VLOOKUP(Table1[[#This Row],[Price Region]],PRICEREGIONLIST,4,FALSE)","v":false},{"$f":"VLOOKUP(Table1[[#This Row],[Price Region]],PRICEREGIONLIST,5,FALSE)","v":false}]
[null,"Philippines",169,"South East Asia",{"$f":"VLOOKUP(Table1[[#This Row],[Price Region]],PRICEREGIONLIST,2,FALSE)","v":23},{"$f":"VLOOKUP(Table1[[#This Row],[Price Region]],PRICEREGIONLIST,3,FALSE)","v":"USD"},{"$f":"IFERROR(VLOOKUP(Table1[[#This Row],[Country Name]],EXCOUNTRYLIST,1,FALSE)<>\"N/A\",\"FALSE\")","v":"FALSE"},{"$f":"VLOOKUP(Table1[[#This Row],[Price Region]],PRICEREGIONLIST,4,FALSE)","v":false},{"$f":"VLOOKUP(Table1[[#This Row],[Price Region]],PRICEREGIONLIST,5,FALSE)","v":false}]
[null,"Pitcairn Islands",170,"South East Asia",{"$f":"VLOOKUP(Table1[[#This Row],[Price Region]],PRICEREGIONLIST,2,FALSE)","v":23},{"$f":"VLOOKUP(Table1[[#This Row],[Price Region]],PRICEREGIONLIST,3,FALSE)","v":"USD"},{"$f":"IFERROR(VLOOKUP(Table1[[#This Row],[Country Name]],EXCOUNTRYLIST,1,FALSE)<>\"N/A\",\"FALSE\")","v":"FALSE"},{"$f":"VLOOKUP(Table1[[#This Row],[Price Region]],PRICEREGIONLIST,4,FALSE)","v":false},{"$f":"VLOOKUP(Table1[[#This Row],[Price Region]],PRICEREGIONLIST,5,FALSE)","v":false}]
[null,"Poland",171,"Eurozone",{"$f":"VLOOKUP(Table1[[#This Row],[Price Region]],PRICEREGIONLIST,2,FALSE)","v":26},{"$f":"VLOOKUP(Table1[[#This Row],[Price Region]],PRICEREGIONLIST,3,FALSE)","v":"EUR"},{"$f":"IFERROR(VLOOKUP(Table1[[#This Row],[Country Name]],EXCOUNTRYLIST,1,FALSE)<>\"N/A\",\"FALSE\")","v":true},{"$f":"VLOOKUP(Table1[[#This Row],[Price Region]],PRICEREGIONLIST,4,FALSE)","v":true},{"$f":"VLOOKUP(Table1[[#This Row],[Price Region]],PRICEREGIONLIST,5,FALSE)","v":false}]
[null,"Portugal",172,"Eurozone",{"$f":"VLOOKUP(Table1[[#This Row],[Price Region]],PRICEREGIONLIST,2,FALSE)","v":26},{"$f":"VLOOKUP(Table1[[#This Row],[Price Region]],PRICEREGIONLIST,3,FALSE)","v":"EUR"},{"$f":"IFERROR(VLOOKUP(Table1[[#This Row],[Country Name]],EXCOUNTRYLIST,1,FALSE)<>\"N/A\",\"FALSE\")","v":"FALSE"},{"$f":"VLOOKUP(Table1[[#This Row],[Price Region]],PRICEREGIONLIST,4,FALSE)","v":true},{"$f":"VLOOKUP(Table1[[#This Row],[Price Region]],PRICEREGIONLIST,5,FALSE)","v":false}]
[null,"Puerto Rico",173,"Latam PR/BM/CI/VI",{"$f":"VLOOKUP(Table1[[#This Row],[Price Region]],PRICEREGIONLIST,2,FALSE)","v":15},{"$f":"VLOOKUP(Table1[[#This Row],[Price Region]],PRICEREGIONLIST,3,FALSE)","v":"USD"},{"$f":"IFERROR(VLOOKUP(Table1[[#This Row],[Country Name]],EXCOUNTRYLIST,1,FALSE)<>\"N/A\",\"FALSE\")","v":"FALSE"},{"$f":"VLOOKUP(Table1[[#This Row],[Price Region]],PRICEREGIONLIST,4,FALSE)","v":false},{"$f":"VLOOKUP(Table1[[#This Row],[Price Region]],PRICEREGIONLIST,5,FALSE)","v":false}]
[null,"Qatar",174,"Middle East",{"$f":"VLOOKUP(Table1[[#This Row],[Price Region]],PRICEREGIONLIST,2,FALSE)","v":17},{"$f":"VLOOKUP(Table1[[#This Row],[Price Region]],PRICEREGIONLIST,3,FALSE)","v":"USD"},{"$f":"IFERROR(VLOOKUP(Table1[[#This Row],[Country Name]],EXCOUNTRYLIST,1,FALSE)<>\"N/A\",\"FALSE\")","v":"FALSE"},{"$f":"VLOOKUP(Table1[[#This Row],[Price Region]],PRICEREGIONLIST,4,FALSE)","v":false},{"$f":"VLOOKUP(Table1[[#This Row],[Price Region]],PRICEREGIONLIST,5,FALSE)","v":false}]
[null,"Reunion",175,"Eurozone",{"$f":"VLOOKUP(Table1[[#This Row],[Price Region]],PRICEREGIONLIST,2,FALSE)","v":26},{"$f":"VLOOKUP(Table1[[#This Row],[Price Region]],PRICEREGIONLIST,3,FALSE)","v":"EUR"},{"$f":"IFERROR(VLOOKUP(Table1[[#This Row],[Country Name]],EXCOUNTRYLIST,1,FALSE)<>\"N/A\",\"FALSE\")","v":"FALSE"},{"$f":"VLOOKUP(Table1[[#This Row],[Price Region]],PRICEREGIONLIST,4,FALSE)","v":true},{"$f":"VLOOKUP(Table1[[#This Row],[Price Region]],PRICEREGIONLIST,5,FALSE)","v":false}]
[null,"Romania",176,"Eurozone",{"$f":"VLOOKUP(Table1[[#This Row],[Price Region]],PRICEREGIONLIST,2,FALSE)","v":26},{"$f":"VLOOKUP(Table1[[#This Row],[Price Region]],PRICEREGIONLIST,3,FALSE)","v":"EUR"},{"$f":"IFERROR(VLOOKUP(Table1[[#This Row],[Country Name]],EXCOUNTRYLIST,1,FALSE)<>\"N/A\",\"FALSE\")","v":"FALSE"},{"$f":"VLOOKUP(Table1[[#This Row],[Price Region]],PRICEREGIONLIST,4,FALSE)","v":true},{"$f":"VLOOKUP(Table1[[#This Row],[Price Region]],PRICEREGIONLIST,5,FALSE)","v":false}]
[null,"Russia",177,"Russia",{"$f":"VLOOKUP(Table1[[#This Row],[Price Region]],PRICEREGIONLIST,2,FALSE)","v":20},{"$f":"VLOOKUP(Table1[[#This Row],[Price Region]],PRICEREGIONLIST,3,FALSE)","v":"RUB"},{"$f":"IFERROR(VLOOKUP(Table1[[#This Row],[Country Name]],EXCOUNTRYLIST,1,FALSE)<>\"N/A\",\"FALSE\")","v":"FALSE"},{"$f":"VLOOKUP(Table1[[#This Row],[Price Region]],PRICEREGIONLIST,4,FALSE)","v":false},{"$f":"VLOOKUP(Table1[[#This Row],[Price Region]],PRICEREGIONLIST,5,FALSE)","v":false}]
[null,"Rwanda",178,"Africa",{"$f":"VLOOKUP(Table1[[#This Row],[Price Region]],PRICEREGIONLIST,2,FALSE)","v":"1"},{"$f":"VLOOKUP(Table1[[#This Row],[Price Region]],PRICEREGIONLIST,3,FALSE)","v":"USD"},{"$f":"IFERROR(VLOOKUP(Table1[[#This Row],[Country Name]],EXCOUNTRYLIST,1,FALSE)<>\"N/A\",\"FALSE\")","v":"FALSE"},{"$f":"VLOOKUP(Table1[[#This Row],[Price Region]],PRICEREGIONLIST,4,FALSE)","v":false},{"$f":"VLOOKUP(Table1[[#This Row],[Price Region]],PRICEREGIONLIST,5,FALSE)","v":false}]
[null,"Saint Helena",179,"United Kingdom2",{"$f":"VLOOKUP(Table1[[#This Row],[Price Region]],PRICEREGIONLIST,2,FALSE)","v":31},{"$f":"VLOOKUP(Table1[[#This Row],[Price Region]],PRICEREGIONLIST,3,FALSE)","v":"GBP"},{"$f":"IFERROR(VLOOKUP(Table1[[#This Row],[Country Name]],EXCOUNTRYLIST,1,FALSE)<>\"N/A\",\"FALSE\")","v":"FALSE"},{"$f":"VLOOKUP(Table1[[#This Row],[Price Region]],PRICEREGIONLIST,4,FALSE)","v":true},{"$f":"VLOOKUP(Table1[[#This Row],[Price Region]],PRICEREGIONLIST,5,FALSE)","v":true}]
[null,"Saint Kitts and Nevis",180,"Latam Caribbean",{"$f":"VLOOKUP(Table1[[#This Row],[Price Region]],PRICEREGIONLIST,2,FALSE)","v":14},{"$f":"VLOOKUP(Table1[[#This Row],[Price Region]],PRICEREGIONLIST,3,FALSE)","v":"USD"},{"$f":"IFERROR(VLOOKUP(Table1[[#This Row],[Country Name]],EXCOUNTRYLIST,1,FALSE)<>\"N/A\",\"FALSE\")","v":"FALSE"},{"$f":"VLOOKUP(Table1[[#This Row],[Price Region]],PRICEREGIONLIST,4,FALSE)","v":false},{"$f":"VLOOKUP(Table1[[#This Row],[Price Region]],PRICEREGIONLIST,5,FALSE)","v":false}]
[null,"Saint Lucia",181,"Latam Caribbean",{"$f":"VLOOKUP(Table1[[#This Row],[Price Region]],PRICEREGIONLIST,2,FALSE)","v":14},{"$f":"VLOOKUP(Table1[[#This Row],[Price Region]],PRICEREGIONLIST,3,FALSE)","v":"USD"},{"$f":"IFERROR(VLOOKUP(Table1[[#This Row],[Country Name]],EXCOUNTRYLIST,1,FALSE)<>\"N/A\",\"FALSE\")","v":"FALSE"},{"$f":"VLOOKUP(Table1[[#This Row],[Price Region]],PRICEREGIONLIST,4,FALSE)","v":false},{"$f":"VLOOKUP(Table1[[#This Row],[Price Region]],PRICEREGIONLIST,5,FALSE)","v":false}]
[null,"Saint Pierre and Miquelon",182,"Canada",{"$f":"VLOOKUP(Table1[[#This Row],[Price Region]],PRICEREGIONLIST,2,FALSE)","v":4},{"$f":"VLOOKUP(Table1[[#This Row],[Price Region]],PRICEREGIONLIST,3,FALSE)","v":"CAD"},{"$f":"IFERROR(VLOOKUP(Table1[[#This Row],[Country Name]],EXCOUNTRYLIST,1,FALSE)<>\"N/A\",\"FALSE\")","v":"FALSE"},{"$f":"VLOOKUP(Table1[[#This Row],[Price Region]],PRICEREGIONLIST,4,FALSE)","v":false},{"$f":"VLOOKUP(Table1[[#This Row],[Price Region]],PRICEREGIONLIST,5,FALSE)","v":false}]
[null,"Saint Vincent and the Grenadines",183,"Latam Caribbean",{"$f":"VLOOKUP(Table1[[#This Row],[Price Region]],PRICEREGIONLIST,2,FALSE)","v":14},{"$f":"VLOOKUP(Table1[[#This Row],[Price Region]],PRICEREGIONLIST,3,FALSE)","v":"USD"},{"$f":"IFERROR(VLOOKUP(Table1[[#This Row],[Country Name]],EXCOUNTRYLIST,1,FALSE)<>\"N/A\",\"FALSE\")","v":"FALSE"},{"$f":"VLOOKUP(Table1[[#This Row],[Price Region]],PRICEREGIONLIST,4,FALSE)","v":false},{"$f":"VLOOKUP(Table1[[#This Row],[Price Region]],PRICEREGIONLIST,5,FALSE)","v":false}]
[null,"Samoa",184,"South East Asia",{"$f":"VLOOKUP(Table1[[#This Row],[Price Region]],PRICEREGIONLIST,2,FALSE)","v":23},{"$f":"VLOOKUP(Table1[[#This Row],[Price Region]],PRICEREGIONLIST,3,FALSE)","v":"USD"},{"$f":"IFERROR(VLOOKUP(Table1[[#This Row],[Country Name]],EXCOUNTRYLIST,1,FALSE)<>\"N/A\",\"FALSE\")","v":"FALSE"},{"$f":"VLOOKUP(Table1[[#This Row],[Price Region]],PRICEREGIONLIST,4,FALSE)","v":false},{"$f":"VLOOKUP(Table1[[#This Row],[Price Region]],PRICEREGIONLIST,5,FALSE)","v":false}]
[null,"San Marino",185,"Eurozone",{"$f":"VLOOKUP(Table1[[#This Row],[Price Region]],PRICEREGIONLIST,2,FALSE)","v":26},{"$f":"VLOOKUP(Table1[[#This Row],[Price Region]],PRICEREGIONLIST,3,FALSE)","v":"EUR"},{"$f":"IFERROR(VLOOKUP(Table1[[#This Row],[Country Name]],EXCOUNTRYLIST,1,FALSE)<>\"N/A\",\"FALSE\")","v":"FALSE"},{"$f":"VLOOKUP(Table1[[#This Row],[Price Region]],PRICEREGIONLIST,4,FALSE)","v":true},{"$f":"VLOOKUP(Table1[[#This Row],[Price Region]],PRICEREGIONLIST,5,FALSE)","v":false}]
[null,"Sao Tomé and Príncipe",186,"Africa",{"$f":"VLOOKUP(Table1[[#This Row],[Price Region]],PRICEREGIONLIST,2,FALSE)","v":"1"},{"$f":"VLOOKUP(Table1[[#This Row],[Price Region]],PRICEREGIONLIST,3,FALSE)","v":"USD"},{"$f":"IFERROR(VLOOKUP(Table1[[#This Row],[Country Name]],EXCOUNTRYLIST,1,FALSE)<>\"N/A\",\"FALSE\")","v":"FALSE"},{"$f":"VLOOKUP(Table1[[#This Row],[Price Region]],PRICEREGIONLIST,4,FALSE)","v":false},{"$f":"VLOOKUP(Table1[[#This Row],[Price Region]],PRICEREGIONLIST,5,FALSE)","v":false}]
[null,"Saudi Arabia",187,"Middle East",{"$f":"VLOOKUP(Table1[[#This Row],[Price Region]],PRICEREGIONLIST,2,FALSE)","v":17},{"$f":"VLOOKUP(Table1[[#This Row],[Price Region]],PRICEREGIONLIST,3,FALSE)","v":"USD"},{"$f":"IFERROR(VLOOKUP(Table1[[#This Row],[Country Name]],EXCOUNTRYLIST,1,FALSE)<>\"N/A\",\"FALSE\")","v":"FALSE"},{"$f":"VLOOKUP(Table1[[#This Row],[Price Region]],PRICEREGIONLIST,4,FALSE)","v":false},{"$f":"VLOOKUP(Table1[[#This Row],[Price Region]],PRICEREGIONLIST,5,FALSE)","v":false}]
[null,"Senegal",188,"Africa",{"$f":"VLOOKUP(Table1[[#This Row],[Price Region]],PRICEREGIONLIST,2,FALSE)","v":"1"},{"$f":"VLOOKUP(Table1[[#This Row],[Price Region]],PRICEREGIONLIST,3,FALSE)","v":"USD"},{"$f":"IFERROR(VLOOKUP(Table1[[#This Row],[Country Name]],EXCOUNTRYLIST,1,FALSE)<>\"N/A\",\"FALSE\")","v":"FALSE"},{"$f":"VLOOKUP(Table1[[#This Row],[Price Region]],PRICEREGIONLIST,4,FALSE)","v":false},{"$f":"VLOOKUP(Table1[[#This Row],[Price Region]],PRICEREGIONLIST,5,FALSE)","v":false}]
[null,"Serbia",189,"Serbia",{"$f":"VLOOKUP(Table1[[#This Row],[Price Region]],PRICEREGIONLIST,2,FALSE)","v":21},{"$f":"VLOOKUP(Table1[[#This Row],[Price Region]],PRICEREGIONLIST,3,FALSE)","v":"USD"},{"$f":"IFERROR(VLOOKUP(Table1[[#This Row],[Country Name]],EXCOUNTRYLIST,1,FALSE)<>\"N/A\",\"FALSE\")","v":"FALSE"},{"$f":"VLOOKUP(Table1[[#This Row],[Price Region]],PRICEREGIONLIST,4,FALSE)","v":false},{"$f":"VLOOKUP(Table1[[#This Row],[Price Region]],PRICEREGIONLIST,5,FALSE)","v":false}]
[null,"Seychelles",190,"Africa",{"$f":"VLOOKUP(Table1[[#This Row],[Price Region]],PRICEREGIONLIST,2,FALSE)","v":"1"},{"$f":"VLOOKUP(Table1[[#This Row],[Price Region]],PRICEREGIONLIST,3,FALSE)","v":"USD"},{"$f":"IFERROR(VLOOKUP(Table1[[#This Row],[Country Name]],EXCOUNTRYLIST,1,FALSE)<>\"N/A\",\"FALSE\")","v":"FALSE"},{"$f":"VLOOKUP(Table1[[#This Row],[Price Region]],PRICEREGIONLIST,4,FALSE)","v":false},{"$f":"VLOOKUP(Table1[[#This Row],[Price Region]],PRICEREGIONLIST,5,FALSE)","v":false}]
[null,"Sierra Leone",191,"Africa",{"$f":"VLOOKUP(Table1[[#This Row],[Price Region]],PRICEREGIONLIST,2,FALSE)","v":"1"},{"$f":"VLOOKUP(Table1[[#This Row],[Price Region]],PRICEREGIONLIST,3,FALSE)","v":"USD"},{"$f":"IFERROR(VLOOKUP(Table1[[#This Row],[Country Name]],EXCOUNTRYLIST,1,FALSE)<>\"N/A\",\"FALSE\")","v":"FALSE"},{"$f":"VLOOKUP(Table1[[#This Row],[Price Region]],PRICEREGIONLIST,4,FALSE)","v":false},{"$f":"VLOOKUP(Table1[[#This Row],[Price Region]],PRICEREGIONLIST,5,FALSE)","v":false}]
[null,"Singapore",192,"South East Asia",{"$f":"VLOOKUP(Table1[[#This Row],[Price Region]],PRICEREGIONLIST,2,FALSE)","v":23},{"$f":"VLOOKUP(Table1[[#This Row],[Price Region]],PRICEREGIONLIST,3,FALSE)","v":"USD"},{"$f":"IFERROR(VLOOKUP(Table1[[#This Row],[Country Name]],EXCOUNTRYLIST,1,FALSE)<>\"N/A\",\"FALSE\")","v":"FALSE"},{"$f":"VLOOKUP(Table1[[#This Row],[Price Region]],PRICEREGIONLIST,4,FALSE)","v":false},{"$f":"VLOOKUP(Table1[[#This Row],[Price Region]],PRICEREGIONLIST,5,FALSE)","v":false}]
[null,"Slovakia",193,"Eurozone",{"$f":"VLOOKUP(Table1[[#This Row],[Price Region]],PRICEREGIONLIST,2,FALSE)","v":26},{"$f":"VLOOKUP(Table1[[#This Row],[Price Region]],PRICEREGIONLIST,3,FALSE)","v":"EUR"},{"$f":"IFERROR(VLOOKUP(Table1[[#This Row],[Country Name]],EXCOUNTRYLIST,1,FALSE)<>\"N/A\",\"FALSE\")","v":"FALSE"},{"$f":"VLOOKUP(Table1[[#This Row],[Price Region]],PRICEREGIONLIST,4,FALSE)","v":true},{"$f":"VLOOKUP(Table1[[#This Row],[Price Region]],PRICEREGIONLIST,5,FALSE)","v":false}]
[null,"Slovenia",194,"Eurozone",{"$f":"VLOOKUP(Table1[[#This Row],[Price Region]],PRICEREGIONLIST,2,FALSE)","v":26},{"$f":"VLOOKUP(Table1[[#This Row],[Price Region]],PRICEREGIONLIST,3,FALSE)","v":"EUR"},{"$f":"IFERROR(VLOOKUP(Table1[[#This Row],[Country Name]],EXCOUNTRYLIST,1,FALSE)<>\"N/A\",\"FALSE\")","v":"FALSE"},{"$f":"VLOOKUP(Table1[[#This Row],[Price Region]],PRICEREGIONLIST,4,FALSE)","v":true},{"$f":"VLOOKUP(Table1[[#This Row],[Price Region]],PRICEREGIONLIST,5,FALSE)","v":false}]
[null,"Solomon Islands",195,"South East Asia",{"$f":"VLOOKUP(Table1[[#This Row],[Price Region]],PRICEREGIONLIST,2,FALSE)","v":23},{"$f":"VLOOKUP(Table1[[#This Row],[Price Region]],PRICEREGIONLIST,3,FALSE)","v":"USD"},{"$f":"IFERROR(VLOOKUP(Table1[[#This Row],[Country Name]],EXCOUNTRYLIST,1,FALSE)<>\"N/A\",\"FALSE\")","v":"FALSE"},{"$f":"VLOOKUP(Table1[[#This Row],[Price Region]],PRICEREGIONLIST,4,FALSE)","v":false},{"$f":"VLOOKUP(Table1[[#This Row],[Price Region]],PRICEREGIONLIST,5,FALSE)","v":false}]
[null,"Somalia",196,"Africa",{"$f":"VLOOKUP(Table1[[#This Row],[Price Region]],PRICEREGIONLIST,2,FALSE)","v":"1"},{"$f":"VLOOKUP(Table1[[#This Row],[Price Region]],PRICEREGIONLIST,3,FALSE)","v":"USD"},{"$f":"IFERROR(VLOOKUP(Table1[[#This Row],[Country Name]],EXCOUNTRYLIST,1,FALSE)<>\"N/A\",\"FALSE\")","v":"FALSE"},{"$f":"VLOOKUP(Table1[[#This Row],[Price Region]],PRICEREGIONLIST,4,FALSE)","v":false},{"$f":"VLOOKUP(Table1[[#This Row],[Price Region]],PRICEREGIONLIST,5,FALSE)","v":false}]
[null,"South Africa",197,"South Africa",{"$f":"VLOOKUP(Table1[[#This Row],[Price Region]],PRICEREGIONLIST,2,FALSE)","v":22},{"$f":"VLOOKUP(Table1[[#This Row],[Price Region]],PRICEREGIONLIST,3,FALSE)","v":"USD"},{"$f":"IFERROR(VLOOKUP(Table1[[#This Row],[Country Name]],EXCOUNTRYLIST,1,FALSE)<>\"N/A\",\"FALSE\")","v":"FALSE"},{"$f":"VLOOKUP(Table1[[#This Row],[Price Region]],PRICEREGIONLIST,4,FALSE)","v":false},{"$f":"VLOOKUP(Table1[[#This Row],[Price Region]],PRICEREGIONLIST,5,FALSE)","v":false}]
[null,"South Georgia and the South Sandwich Islands",198,"Rest of Latam",{"$f":"VLOOKUP(Table1[[#This Row],[Price Region]],PRICEREGIONLIST,2,FALSE)","v":19},{"$f":"VLOOKUP(Table1[[#This Row],[Price Region]],PRICEREGIONLIST,3,FALSE)","v":"USD"},{"$f":"IFERROR(VLOOKUP(Table1[[#This Row],[Country Name]],EXCOUNTRYLIST,1,FALSE)<>\"N/A\",\"FALSE\")","v":"FALSE"},{"$f":"VLOOKUP(Table1[[#This Row],[Price Region]],PRICEREGIONLIST,4,FALSE)","v":false},{"$f":"VLOOKUP(Table1[[#This Row],[Price Region]],PRICEREGIONLIST,5,FALSE)","v":false}]
[null,"Spain",199,"Eurozone",{"$f":"VLOOKUP(Table1[[#This Row],[Price Region]],PRICEREGIONLIST,2,FALSE)","v":26},{"$f":"VLOOKUP(Table1[[#This Row],[Price Region]],PRICEREGIONLIST,3,FALSE)","v":"EUR"},{"$f":"IFERROR(VLOOKUP(Table1[[#This Row],[Country Name]],EXCOUNTRYLIST,1,FALSE)<>\"N/A\",\"FALSE\")","v":"FALSE"},{"$f":"VLOOKUP(Table1[[#This Row],[Price Region]],PRICEREGIONLIST,4,FALSE)","v":true},{"$f":"VLOOKUP(Table1[[#This Row],[Price Region]],PRICEREGIONLIST,5,FALSE)","v":false}]
[null,"Sri Lanka",200,"South East Asia",{"$f":"VLOOKUP(Table1[[#This Row],[Price Region]],PRICEREGIONLIST,2,FALSE)","v":23},{"$f":"VLOOKUP(Table1[[#This Row],[Price Region]],PRICEREGIONLIST,3,FALSE)","v":"USD"},{"$f":"IFERROR(VLOOKUP(Table1[[#This Row],[Country Name]],EXCOUNTRYLIST,1,FALSE)<>\"N/A\",\"FALSE\")","v":"FALSE"},{"$f":"VLOOKUP(Table1[[#This Row],[Price Region]],PRICEREGIONLIST,4,FALSE)","v":false},{"$f":"VLOOKUP(Table1[[#This Row],[Price Region]],PRICEREGIONLIST,5,FALSE)","v":false}]
[null,"Sudan",201,"Africa",{"$f":"VLOOKUP(Table1[[#This Row],[Price Region]],PRICEREGIONLIST,2,FALSE)","v":"1"},{"$f":"VLOOKUP(Table1[[#This Row],[Price Region]],PRICEREGIONLIST,3,FALSE)","v":"USD"},{"$f":"IFERROR(VLOOKUP(Table1[[#This Row],[Country Name]],EXCOUNTRYLIST,1,FALSE)<>\"N/A\",\"FALSE\")","v":true},{"$f":"VLOOKUP(Table1[[#This Row],[Price Region]],PRICEREGIONLIST,4,FALSE)","v":false},{"$f":"VLOOKUP(Table1[[#This Row],[Price Region]],PRICEREGIONLIST,5,FALSE)","v":false}]
[null,"Suriname",202,"Latam Caribbean",{"$f":"VLOOKUP(Table1[[#This Row],[Price Region]],PRICEREGIONLIST,2,FALSE)","v":14},{"$f":"VLOOKUP(Table1[[#This Row],[Price Region]],PRICEREGIONLIST,3,FALSE)","v":"USD"},{"$f":"IFERROR(VLOOKUP(Table1[[#This Row],[Country Name]],EXCOUNTRYLIST,1,FALSE)<>\"N/A\",\"FALSE\")","v":"FALSE"},{"$f":"VLOOKUP(Table1[[#This Row],[Price Region]],PRICEREGIONLIST,4,FALSE)","v":false},{"$f":"VLOOKUP(Table1[[#This Row],[Price Region]],PRICEREGIONLIST,5,FALSE)","v":false}]
[null,"Svalbard and Jan Mayen",203,"Norway2",{"$f":"VLOOKUP(Table1[[#This Row],[Price Region]],PRICEREGIONLIST,2,FALSE)","v":28},{"$f":"VLOOKUP(Table1[[#This Row],[Price Region]],PRICEREGIONLIST,3,FALSE)","v":"NOK"},{"$f":"IFERROR(VLOOKUP(Table1[[#This Row],[Country Name]],EXCOUNTRYLIST,1,FALSE)<>\"N/A\",\"FALSE\")","v":"FALSE"},{"$f":"VLOOKUP(Table1[[#This Row],[Price Region]],PRICEREGIONLIST,4,FALSE)","v":true},{"$f":"VLOOKUP(Table1[[#This Row],[Price Region]],PRICEREGIONLIST,5,FALSE)","v":true}]
[null,"Swaziland",204,"Africa",{"$f":"VLOOKUP(Table1[[#This Row],[Price Region]],PRICEREGIONLIST,2,FALSE)","v":"1"},{"$f":"VLOOKUP(Table1[[#This Row],[Price Region]],PRICEREGIONLIST,3,FALSE)","v":"USD"},{"$f":"IFERROR(VLOOKUP(Table1[[#This Row],[Country Name]],EXCOUNTRYLIST,1,FALSE)<>\"N/A\",\"FALSE\")","v":"FALSE"},{"$f":"VLOOKUP(Table1[[#This Row],[Price Region]],PRICEREGIONLIST,4,FALSE)","v":false},{"$f":"VLOOKUP(Table1[[#This Row],[Price Region]],PRICEREGIONLIST,5,FALSE)","v":false}]
[null,"Sweden",205,"Sweden2",{"$f":"VLOOKUP(Table1[[#This Row],[Price Region]],PRICEREGIONLIST,2,FALSE)","v":29},{"$f":"VLOOKUP(Table1[[#This Row],[Price Region]],PRICEREGIONLIST,3,FALSE)","v":"SEK"},{"$f":"IFERROR(VLOOKUP(Table1[[#This Row],[Country Name]],EXCOUNTRYLIST,1,FALSE)<>\"N/A\",\"FALSE\")","v":"FALSE"},{"$f":"VLOOKUP(Table1[[#This Row],[Price Region]],PRICEREGIONLIST,4,FALSE)","v":true},{"$f":"VLOOKUP(Table1[[#This Row],[Price Region]],PRICEREGIONLIST,5,FALSE)","v":true}]
[null,"Switzerland",206,"Switzerland2",{"$f":"VLOOKUP(Table1[[#This Row],[Price Region]],PRICEREGIONLIST,2,FALSE)","v":30},{"$f":"VLOOKUP(Table1[[#This Row],[Price Region]],PRICEREGIONLIST,3,FALSE)","v":"CHF"},{"$f":"IFERROR(VLOOKUP(Table1[[#This Row],[Country Name]],EXCOUNTRYLIST,1,FALSE)<>\"N/A\",\"FALSE\")","v":"FALSE"},{"$f":"VLOOKUP(Table1[[#This Row],[Price Region]],PRICEREGIONLIST,4,FALSE)","v":true},{"$f":"VLOOKUP(Table1[[#This Row],[Price Region]],PRICEREGIONLIST,5,FALSE)","v":true}]
[null,"Syria",207,"Middle East",{"$f":"VLOOKUP(Table1[[#This Row],[Price Region]],PRICEREGIONLIST,2,FALSE)","v":17},{"$f":"VLOOKUP(Table1[[#This Row],[Price Region]],PRICEREGIONLIST,3,FALSE)","v":"USD"},{"$f":"IFERROR(VLOOKUP(Table1[[#This Row],[Country Name]],EXCOUNTRYLIST,1,FALSE)<>\"N/A\",\"FALSE\")","v":true},{"$f":"VLOOKUP(Table1[[#This Row],[Price Region]],PRICEREGIONLIST,4,FALSE)","v":false},{"$f":"VLOOKUP(Table1[[#This Row],[Price Region]],PRICEREGIONLIST,5,FALSE)","v":false}]
[null,"Taiwan",208,"South East Asia",{"$f":"VLOOKUP(Table1[[#This Row],[Price Region]],PRICEREGIONLIST,2,FALSE)","v":23},{"$f":"VLOOKUP(Table1[[#This Row],[Price Region]],PRICEREGIONLIST,3,FALSE)","v":"USD"},{"$f":"IFERROR(VLOOKUP(Table1[[#This Row],[Country Name]],EXCOUNTRYLIST,1,FALSE)<>\"N/A\",\"FALSE\")","v":"FALSE"},{"$f":"VLOOKUP(Table1[[#This Row],[Price Region]],PRICEREGIONLIST,4,FALSE)","v":false},{"$f":"VLOOKUP(Table1[[#This Row],[Price Region]],PRICEREGIONLIST,5,FALSE)","v":false}]
[null,"Tajikistan",209,"Central Asia 2 - CEE 2",{"$f":"VLOOKUP(Table1[[#This Row],[Price Region]],PRICEREGIONLIST,2,FALSE)","v":6},{"$f":"VLOOKUP(Table1[[#This Row],[Price Region]],PRICEREGIONLIST,3,FALSE)","v":"USD"},{"$f":"IFERROR(VLOOKUP(Table1[[#This Row],[Country Name]],EXCOUNTRYLIST,1,FALSE)<>\"N/A\",\"FALSE\")","v":"FALSE"},{"$f":"VLOOKUP(Table1[[#This Row],[Price Region]],PRICEREGIONLIST,4,FALSE)","v":false},{"$f":"VLOOKUP(Table1[[#This Row],[Price Region]],PRICEREGIONLIST,5,FALSE)","v":false}]
[null,"Tanzania",210,"Africa",{"$f":"VLOOKUP(Table1[[#This Row],[Price Region]],PRICEREGIONLIST,2,FALSE)","v":"1"},{"$f":"VLOOKUP(Table1[[#This Row],[Price Region]],PRICEREGIONLIST,3,FALSE)","v":"USD"},{"$f":"IFERROR(VLOOKUP(Table1[[#This Row],[Country Name]],EXCOUNTRYLIST,1,FALSE)<>\"N/A\",\"FALSE\")","v":"FALSE"},{"$f":"VLOOKUP(Table1[[#This Row],[Price Region]],PRICEREGIONLIST,4,FALSE)","v":false},{"$f":"VLOOKUP(Table1[[#This Row],[Price Region]],PRICEREGIONLIST,5,FALSE)","v":false}]
[null,"Thailand",211,"South East Asia",{"$f":"VLOOKUP(Table1[[#This Row],[Price Region]],PRICEREGIONLIST,2,FALSE)","v":23},{"$f":"VLOOKUP(Table1[[#This Row],[Price Region]],PRICEREGIONLIST,3,FALSE)","v":"USD"},{"$f":"IFERROR(VLOOKUP(Table1[[#This Row],[Country Name]],EXCOUNTRYLIST,1,FALSE)<>\"N/A\",\"FALSE\")","v":"FALSE"},{"$f":"VLOOKUP(Table1[[#This Row],[Price Region]],PRICEREGIONLIST,4,FALSE)","v":false},{"$f":"VLOOKUP(Table1[[#This Row],[Price Region]],PRICEREGIONLIST,5,FALSE)","v":false}]
[null,"Timor-Leste",212,"South East Asia",{"$f":"VLOOKUP(Table1[[#This Row],[Price Region]],PRICEREGIONLIST,2,FALSE)","v":23},{"$f":"VLOOKUP(Table1[[#This Row],[Price Region]],PRICEREGIONLIST,3,FALSE)","v":"USD"},{"$f":"IFERROR(VLOOKUP(Table1[[#This Row],[Country Name]],EXCOUNTRYLIST,1,FALSE)<>\"N/A\",\"FALSE\")","v":"FALSE"},{"$f":"VLOOKUP(Table1[[#This Row],[Price Region]],PRICEREGIONLIST,4,FALSE)","v":false},{"$f":"VLOOKUP(Table1[[#This Row],[Price Region]],PRICEREGIONLIST,5,FALSE)","v":false}]
[null,"Togo",213,"Africa",{"$f":"VLOOKUP(Table1[[#This Row],[Price Region]],PRICEREGIONLIST,2,FALSE)","v":"1"},{"$f":"VLOOKUP(Table1[[#This Row],[Price Region]],PRICEREGIONLIST,3,FALSE)","v":"USD"},{"$f":"IFERROR(VLOOKUP(Table1[[#This Row],[Country Name]],EXCOUNTRYLIST,1,FALSE)<>\"N/A\",\"FALSE\")","v":"FALSE"},{"$f":"VLOOKUP(Table1[[#This Row],[Price Region]],PRICEREGIONLIST,4,FALSE)","v":false},{"$f":"VLOOKUP(Table1[[#This Row],[Price Region]],PRICEREGIONLIST,5,FALSE)","v":false}]
[null,"Tokelau",214,"New Zealand",{"$f":"VLOOKUP(Table1[[#This Row],[Price Region]],PRICEREGIONLIST,2,FALSE)","v":18},{"$f":"VLOOKUP(Table1[[#This Row],[Price Region]],PRICEREGIONLIST,3,FALSE)","v":"NZD"},{"$f":"IFERROR(VLOOKUP(Table1[[#This Row],[Country Name]],EXCOUNTRYLIST,1,FALSE)<>\"N/A\",\"FALSE\")","v":"FALSE"},{"$f":"VLOOKUP(Table1[[#This Row],[Price Region]],PRICEREGIONLIST,4,FALSE)","v":false},{"$f":"VLOOKUP(Table1[[#This Row],[Price Region]],PRICEREGIONLIST,5,FALSE)","v":false}]
[null,"Tonga",215,"South East Asia",{"$f":"VLOOKUP(Table1[[#This Row],[Price Region]],PRICEREGIONLIST,2,FALSE)","v":23},{"$f":"VLOOKUP(Table1[[#This Row],[Price Region]],PRICEREGIONLIST,3,FALSE)","v":"USD"},{"$f":"IFERROR(VLOOKUP(Table1[[#This Row],[Country Name]],EXCOUNTRYLIST,1,FALSE)<>\"N/A\",\"FALSE\")","v":"FALSE"},{"$f":"VLOOKUP(Table1[[#This Row],[Price Region]],PRICEREGIONLIST,4,FALSE)","v":false},{"$f":"VLOOKUP(Table1[[#This Row],[Price Region]],PRICEREGIONLIST,5,FALSE)","v":false}]
[null,"Trinidad and Tobago",216,"Latam Caribbean",{"$f":"VLOOKUP(Table1[[#This Row],[Price Region]],PRICEREGIONLIST,2,FALSE)","v":14},{"$f":"VLOOKUP(Table1[[#This Row],[Price Region]],PRICEREGIONLIST,3,FALSE)","v":"USD"},{"$f":"IFERROR(VLOOKUP(Table1[[#This Row],[Country Name]],EXCOUNTRYLIST,1,FALSE)<>\"N/A\",\"FALSE\")","v":"FALSE"},{"$f":"VLOOKUP(Table1[[#This Row],[Price Region]],PRICEREGIONLIST,4,FALSE)","v":false},{"$f":"VLOOKUP(Table1[[#This Row],[Price Region]],PRICEREGIONLIST,5,FALSE)","v":false}]
[null,"Tunisia",217,"Africa",{"$f":"VLOOKUP(Table1[[#This Row],[Price Region]],PRICEREGIONLIST,2,FALSE)","v":"1"},{"$f":"VLOOKUP(Table1[[#This Row],[Price Region]],PRICEREGIONLIST,3,FALSE)","v":"USD"},{"$f":"IFERROR(VLOOKUP(Table1[[#This Row],[Country Name]],EXCOUNTRYLIST,1,FALSE)<>\"N/A\",\"FALSE\")","v":"FALSE"},{"$f":"VLOOKUP(Table1[[#This Row],[Price Region]],PRICEREGIONLIST,4,FALSE)","v":false},{"$f":"VLOOKUP(Table1[[#This Row],[Price Region]],PRICEREGIONLIST,5,FALSE)","v":false}]
[null,"Turkey",218,"Turkey",{"$f":"VLOOKUP(Table1[[#This Row],[Price Region]],PRICEREGIONLIST,2,FALSE)","v":24},{"$f":"VLOOKUP(Table1[[#This Row],[Price Region]],PRICEREGIONLIST,3,FALSE)","v":"USD"},{"$f":"IFERROR(VLOOKUP(Table1[[#This Row],[Country Name]],EXCOUNTRYLIST,1,FALSE)<>\"N/A\",\"FALSE\")","v":"FALSE"},{"$f":"VLOOKUP(Table1[[#This Row],[Price Region]],PRICEREGIONLIST,4,FALSE)","v":false},{"$f":"VLOOKUP(Table1[[#This Row],[Price Region]],PRICEREGIONLIST,5,FALSE)","v":false}]
[null,"Turkmenistan",219,"Central Asia 2 - CEE 2",{"$f":"VLOOKUP(Table1[[#This Row],[Price Region]],PRICEREGIONLIST,2,FALSE)","v":6},{"$f":"VLOOKUP(Table1[[#This Row],[Price Region]],PRICEREGIONLIST,3,FALSE)","v":"USD"},{"$f":"IFERROR(VLOOKUP(Table1[[#This Row],[Country Name]],EXCOUNTRYLIST,1,FALSE)<>\"N/A\",\"FALSE\")","v":"FALSE"},{"$f":"VLOOKUP(Table1[[#This Row],[Price Region]],PRICEREGIONLIST,4,FALSE)","v":false},{"$f":"VLOOKUP(Table1[[#This Row],[Price Region]],PRICEREGIONLIST,5,FALSE)","v":false}]
[null,"Turks and Caicos Islands",220,"Latam Caribbean",{"$f":"VLOOKUP(Table1[[#This Row],[Price Region]],PRICEREGIONLIST,2,FALSE)","v":14},{"$f":"VLOOKUP(Table1[[#This Row],[Price Region]],PRICEREGIONLIST,3,FALSE)","v":"USD"},{"$f":"IFERROR(VLOOKUP(Table1[[#This Row],[Country Name]],EXCOUNTRYLIST,1,FALSE)<>\"N/A\",\"FALSE\")","v":"FALSE"},{"$f":"VLOOKUP(Table1[[#This Row],[Price Region]],PRICEREGIONLIST,4,FALSE)","v":false},{"$f":"VLOOKUP(Table1[[#This Row],[Price Region]],PRICEREGIONLIST,5,FALSE)","v":false}]
[null,"Tuvalu",221,"Australia",{"$f":"VLOOKUP(Table1[[#This Row],[Price Region]],PRICEREGIONLIST,2,FALSE)","v":3},{"$f":"VLOOKUP(Table1[[#This Row],[Price Region]],PRICEREGIONLIST,3,FALSE)","v":"AUD"},{"$f":"IFERROR(VLOOKUP(Table1[[#This Row],[Country Name]],EXCOUNTRYLIST,1,FALSE)<>\"N/A\",\"FALSE\")","v":"FALSE"},{"$f":"VLOOKUP(Table1[[#This Row],[Price Region]],PRICEREGIONLIST,4,FALSE)","v":false},{"$f":"VLOOKUP(Table1[[#This Row],[Price Region]],PRICEREGIONLIST,5,FALSE)","v":false}]
[null,"U.S. Minor Outlying Islands",222,"United States",{"$f":"VLOOKUP(Table1[[#This Row],[Price Region]],PRICEREGIONLIST,2,FALSE)","v":25},{"$f":"VLOOKUP(Table1[[#This Row],[Price Region]],PRICEREGIONLIST,3,FALSE)","v":"USD"},{"$f":"IFERROR(VLOOKUP(Table1[[#This Row],[Country Name]],EXCOUNTRYLIST,1,FALSE)<>\"N/A\",\"FALSE\")","v":"FALSE"},{"$f":"VLOOKUP(Table1[[#This Row],[Price Region]],PRICEREGIONLIST,4,FALSE)","v":false},{"$f":"VLOOKUP(Table1[[#This Row],[Price Region]],PRICEREGIONLIST,5,FALSE)","v":false}]
[null,"Uganda",223,"Africa",{"$f":"VLOOKUP(Table1[[#This Row],[Price Region]],PRICEREGIONLIST,2,FALSE)","v":"1"},{"$f":"VLOOKUP(Table1[[#This Row],[Price Region]],PRICEREGIONLIST,3,FALSE)","v":"USD"},{"$f":"IFERROR(VLOOKUP(Table1[[#This Row],[Country Name]],EXCOUNTRYLIST,1,FALSE)<>\"N/A\",\"FALSE\")","v":"FALSE"},{"$f":"VLOOKUP(Table1[[#This Row],[Price Region]],PRICEREGIONLIST,4,FALSE)","v":false},{"$f":"VLOOKUP(Table1[[#This Row],[Price Region]],PRICEREGIONLIST,5,FALSE)","v":false}]
[null,"Ukraine",224,"Eastern Europe 2",{"$f":"VLOOKUP(Table1[[#This Row],[Price Region]],PRICEREGIONLIST,2,FALSE)","v":11},{"$f":"VLOOKUP(Table1[[#This Row],[Price Region]],PRICEREGIONLIST,3,FALSE)","v":"USD"},{"$f":"IFERROR(VLOOKUP(Table1[[#This Row],[Country Name]],EXCOUNTRYLIST,1,FALSE)<>\"N/A\",\"FALSE\")","v":"FALSE"},{"$f":"VLOOKUP(Table1[[#This Row],[Price Region]],PRICEREGIONLIST,4,FALSE)","v":false},{"$f":"VLOOKUP(Table1[[#This Row],[Price Region]],PRICEREGIONLIST,5,FALSE)","v":false}]
[null,"United Arab Emirates",225,"Middle East",{"$f":"VLOOKUP(Table1[[#This Row],[Price Region]],PRICEREGIONLIST,2,FALSE)","v":17},{"$f":"VLOOKUP(Table1[[#This Row],[Price Region]],PRICEREGIONLIST,3,FALSE)","v":"USD"},{"$f":"IFERROR(VLOOKUP(Table1[[#This Row],[Country Name]],EXCOUNTRYLIST,1,FALSE)<>\"N/A\",\"FALSE\")","v":"FALSE"},{"$f":"VLOOKUP(Table1[[#This Row],[Price Region]],PRICEREGIONLIST,4,FALSE)","v":false},{"$f":"VLOOKUP(Table1[[#This Row],[Price Region]],PRICEREGIONLIST,5,FALSE)","v":false}]
[null,"United Kingdom",226,"United Kingdom2",{"$f":"VLOOKUP(Table1[[#This Row],[Price Region]],PRICEREGIONLIST,2,FALSE)","v":31},{"$f":"VLOOKUP(Table1[[#This Row],[Price Region]],PRICEREGIONLIST,3,FALSE)","v":"GBP"},{"$f":"IFERROR(VLOOKUP(Table1[[#This Row],[Country Name]],EXCOUNTRYLIST,1,FALSE)<>\"N/A\",\"FALSE\")","v":"FALSE"},{"$f":"VLOOKUP(Table1[[#This Row],[Price Region]],PRICEREGIONLIST,4,FALSE)","v":true},{"$f":"VLOOKUP(Table1[[#This Row],[Price Region]],PRICEREGIONLIST,5,FALSE)","v":true}]
[null,"United States",227,"United States",{"$f":"VLOOKUP(Table1[[#This Row],[Price Region]],PRICEREGIONLIST,2,FALSE)","v":25},{"$f":"VLOOKUP(Table1[[#This Row],[Price Region]],PRICEREGIONLIST,3,FALSE)","v":"USD"},{"$f":"IFERROR(VLOOKUP(Table1[[#This Row],[Country Name]],EXCOUNTRYLIST,1,FALSE)<>\"N/A\",\"FALSE\")","v":"FALSE"},{"$f":"VLOOKUP(Table1[[#This Row],[Price Region]],PRICEREGIONLIST,4,FALSE)","v":false},{"$f":"VLOOKUP(Table1[[#This Row],[Price Region]],PRICEREGIONLIST,5,FALSE)","v":false}]
[null,"Uruguay",228,"Rest of Latam",{"$f":"VLOOKUP(Table1[[#This Row],[Price Region]],PRICEREGIONLIST,2,FALSE)","v":19},{"$f":"VLOOKUP(Table1[[#This Row],[Price Region]],PRICEREGIONLIST,3,FALSE)","v":"USD"},{"$f":"IFERROR(VLOOKUP(Table1[[#This Row],[Country Name]],EXCOUNTRYLIST,1,FALSE)<>\"N/A\",\"FALSE\")","v":"FALSE"},{"$f":"VLOOKUP(Table1[[#This Row],[Price Region]],PRICEREGIONLIST,4,FALSE)","v":false},{"$f":"VLOOKUP(Table1[[#This Row],[Price Region]],PRICEREGIONLIST,5,FALSE)","v":false}]
[null,"Uzbekistan",229,"Central Asia 2 - CEE 2",{"$f":"VLOOKUP(Table1[[#This Row],[Price Region]],PRICEREGIONLIST,2,FALSE)","v":6},{"$f":"VLOOKUP(Table1[[#This Row],[Price Region]],PRICEREGIONLIST,3,FALSE)","v":"USD"},{"$f":"IFERROR(VLOOKUP(Table1[[#This Row],[Country Name]],EXCOUNTRYLIST,1,FALSE)<>\"N/A\",\"FALSE\")","v":"FALSE"},{"$f":"VLOOKUP(Table1[[#This Row],[Price Region]],PRICEREGIONLIST,4,FALSE)","v":false},{"$f":"VLOOKUP(Table1[[#This Row],[Price Region]],PRICEREGIONLIST,5,FALSE)","v":false}]
[null,"Vanuatu",230,"South East Asia",{"$f":"VLOOKUP(Table1[[#This Row],[Price Region]],PRICEREGIONLIST,2,FALSE)","v":23},{"$f":"VLOOKUP(Table1[[#This Row],[Price Region]],PRICEREGIONLIST,3,FALSE)","v":"USD"},{"$f":"IFERROR(VLOOKUP(Table1[[#This Row],[Country Name]],EXCOUNTRYLIST,1,FALSE)<>\"N/A\",\"FALSE\")","v":"FALSE"},{"$f":"VLOOKUP(Table1[[#This Row],[Price Region]],PRICEREGIONLIST,4,FALSE)","v":false},{"$f":"VLOOKUP(Table1[[#This Row],[Price Region]],PRICEREGIONLIST,5,FALSE)","v":false}]
[null,"Vatican City",231,"Eurozone",{"$f":"VLOOKUP(Table1[[#This Row],[Price Region]],PRICEREGIONLIST,2,FALSE)","v":26},{"$f":"VLOOKUP(Table1[[#This Row],[Price Region]],PRICEREGIONLIST,3,FALSE)","v":"EUR"},{"$f":"IFERROR(VLOOKUP(Table1[[#This Row],[Country Name]],EXCOUNTRYLIST,1,FALSE)<>\"N/A\",\"FALSE\")","v":"FALSE"},{"$f":"VLOOKUP(Table1[[#This Row],[Price Region]],PRICEREGIONLIST,4,FALSE)","v":true},{"$f":"VLOOKUP(Table1[[#This Row],[Price Region]],PRICEREGIONLIST,5,FALSE)","v":false}]
[null,"Venezuela",232,"Rest of Latam",{"$f":"VLOOKUP(Table1[[#This Row],[Price Region]],PRICEREGIONLIST,2,FALSE)","v":19},{"$f":"VLOOKUP(Table1[[#This Row],[Price Region]],PRICEREGIONLIST,3,FALSE)","v":"USD"},{"$f":"IFERROR(VLOOKUP(Table1[[#This Row],[Country Name]],EXCOUNTRYLIST,1,FALSE)<>\"N/A\",\"FALSE\")","v":"FALSE"},{"$f":"VLOOKUP(Table1[[#This Row],[Price Region]],PRICEREGIONLIST,4,FALSE)","v":false},{"$f":"VLOOKUP(Table1[[#This Row],[Price Region]],PRICEREGIONLIST,5,FALSE)","v":false}]
[null,"Vietnam",233,"South East Asia",{"$f":"VLOOKUP(Table1[[#This Row],[Price Region]],PRICEREGIONLIST,2,FALSE)","v":23},{"$f":"VLOOKUP(Table1[[#This Row],[Price Region]],PRICEREGIONLIST,3,FALSE)","v":"USD"},{"$f":"IFERROR(VLOOKUP(Table1[[#This Row],[Country Name]],EXCOUNTRYLIST,1,FALSE)<>\"N/A\",\"FALSE\")","v":"FALSE"},{"$f":"VLOOKUP(Table1[[#This Row],[Price Region]],PRICEREGIONLIST,4,FALSE)","v":false},{"$f":"VLOOKUP(Table1[[#This Row],[Price Region]],PRICEREGIONLIST,5,FALSE)","v":false}]
[null,"Virgin Islands, British",234,"Latam Caribbean",{"$f":"VLOOKUP(Table1[[#This Row],[Price Region]],PRICEREGIONLIST,2,FALSE)","v":14},{"$f":"VLOOKUP(Table1[[#This Row],[Price Region]],PRICEREGIONLIST,3,FALSE)","v":"USD"},{"$f":"IFERROR(VLOOKUP(Table1[[#This Row],[Country Name]],EXCOUNTRYLIST,1,FALSE)<>\"N/A\",\"FALSE\")","v":"FALSE"},{"$f":"VLOOKUP(Table1[[#This Row],[Price Region]],PRICEREGIONLIST,4,FALSE)","v":false},{"$f":"VLOOKUP(Table1[[#This Row],[Price Region]],PRICEREGIONLIST,5,FALSE)","v":false}]
[null,"Virgin Islands, U.S.",235,"Latam PR/BM/CI/VI",{"$f":"VLOOKUP(Table1[[#This Row],[Price Region]],PRICEREGIONLIST,2,FALSE)","v":15},{"$f":"VLOOKUP(Table1[[#This Row],[Price Region]],PRICEREGIONLIST,3,FALSE)","v":"USD"},{"$f":"IFERROR(VLOOKUP(Table1[[#This Row],[Country Name]],EXCOUNTRYLIST,1,FALSE)<>\"N/A\",\"FALSE\")","v":"FALSE"},{"$f":"VLOOKUP(Table1[[#This Row],[Price Region]],PRICEREGIONLIST,4,FALSE)","v":false},{"$f":"VLOOKUP(Table1[[#This Row],[Price Region]],PRICEREGIONLIST,5,FALSE)","v":false}]
[null,"Wallis and Futuna",236,"South East Asia",{"$f":"VLOOKUP(Table1[[#This Row],[Price Region]],PRICEREGIONLIST,2,FALSE)","v":23},{"$f":"VLOOKUP(Table1[[#This Row],[Price Region]],PRICEREGIONLIST,3,FALSE)","v":"USD"},{"$f":"IFERROR(VLOOKUP(Table1[[#This Row],[Country Name]],EXCOUNTRYLIST,1,FALSE)<>\"N/A\",\"FALSE\")","v":"FALSE"},{"$f":"VLOOKUP(Table1[[#This Row],[Price Region]],PRICEREGIONLIST,4,FALSE)","v":false},{"$f":"VLOOKUP(Table1[[#This Row],[Price Region]],PRICEREGIONLIST,5,FALSE)","v":false}]
[null,"Western Sahara",238,"Africa",{"$f":"VLOOKUP(Table1[[#This Row],[Price Region]],PRICEREGIONLIST,2,FALSE)","v":"1"},{"$f":"VLOOKUP(Table1[[#This Row],[Price Region]],PRICEREGIONLIST,3,FALSE)","v":"USD"},{"$f":"IFERROR(VLOOKUP(Table1[[#This Row],[Country Name]],EXCOUNTRYLIST,1,FALSE)<>\"N/A\",\"FALSE\")","v":"FALSE"},{"$f":"VLOOKUP(Table1[[#This Row],[Price Region]],PRICEREGIONLIST,4,FALSE)","v":false},{"$f":"VLOOKUP(Table1[[#This Row],[Price Region]],PRICEREGIONLIST,5,FALSE)","v":false}]
[null,"Yemen",239,"Middle East",{"$f":"VLOOKUP(Table1[[#This Row],[Price Region]],PRICEREGIONLIST,2,FALSE)","v":17},{"$f":"VLOOKUP(Table1[[#This Row],[Price Region]],PRICEREGIONLIST,3,FALSE)","v":"USD"},{"$f":"IFERROR(VLOOKUP(Table1[[#This Row],[Country Name]],EXCOUNTRYLIST,1,FALSE)<>\"N/A\",\"FALSE\")","v":"FALSE"},{"$f":"VLOOKUP(Table1[[#This Row],[Price Region]],PRICEREGIONLIST,4,FALSE)","v":false},{"$f":"VLOOKUP(Table1[[#This Row],[Price Region]],PRICEREGIONLIST,5,FALSE)","v":false}]
[null,"Zambia",240,"Africa",{"$f":"VLOOKUP(Table1[[#This Row],[Price Region]],PRICEREGIONLIST,2,FALSE)","v":"1"},{"$f":"VLOOKUP(Table1[[#This Row],[Price Region]],PRICEREGIONLIST,3,FALSE)","v":"USD"},{"$f":"IFERROR(VLOOKUP(Table1[[#This Row],[Country Name]],EXCOUNTRYLIST,1,FALSE)<>\"N/A\",\"FALSE\")","v":"FALSE"},{"$f":"VLOOKUP(Table1[[#This Row],[Price Region]],PRICEREGIONLIST,4,FALSE)","v":false},{"$f":"VLOOKUP(Table1[[#This Row],[Price Region]],PRICEREGIONLIST,5,FALSE)","v":false}]
[null,"Zimbabwe",241,"Africa",{"$f":"VLOOKUP(Table1[[#This Row],[Price Region]],PRICEREGIONLIST,2,FALSE)","v":"1"},{"$f":"VLOOKUP(Table1[[#This Row],[Price Region]],PRICEREGIONLIST,3,FALSE)","v":"USD"},{"$f":"IFERROR(VLOOKUP(Table1[[#This Row],[Country Name]],EXCOUNTRYLIST,1,FALSE)<>\"N/A\",\"FALSE\")","v":"FALSE"},{"$f":"VLOOKUP(Table1[[#This Row],[Price Region]],PRICEREGIONLIST,4,FALSE)","v":false},{"$f":"VLOOKUP(Table1[[#This Row],[Price Region]],PRICEREGIONLIST,5,FALSE)","v":false}]

{"sheet":"CRM FuseBox","index":12,"n_rows":38,"n_cols":6,"rows_kept":38,"cut":false,"hidden":true,"merged":[[17,1,18,1]]}
[]
[null,"CRITERION","VALUE 1","VALUE 2","Notes"]
[null,"Customer Location",{"$f":"CUSTOMERLOCATION","v":"United States"}]
[null,"Cust Country Lookup"]
[null,"Cust Country Code",{"$f":"VLOOKUP(C3,COUNTRYLIST,2,FALSE)","v":227},{"$f":"IF(VLOOKUP(CRMCUSTOMERLOCATION,COUNTRYLIST,6,FALSE)=TRUE,\"Excluded\",\"\")","v":""},"Checks for Excluded Country"]
[null,"Display PartnerBox?",{"$f":"IF(VLOOKUP(C3,COUNTRYLIST,7,FALSE) = TRUE,\"EEAS\",\"\")","v":""},{"$f":"IFERROR(IF(VLOOKUP(C3,COUNTRYLIST,7,FALSE)=TRUE, \"Yes\",\"No\"),\"No\")","v":"No"},"Checks for EEAS Country and drives partner box display"]
[null,"Customer Region",{"$f":"VLOOKUP(C3,COUNTRYLIST,3,FALSE)","v":"United States"},{"$f":"VLOOKUP(C3,COUNTRYLIST,5,FALSE)","v":"USD"},"Region name & Region currency"]
[null,"Cust Region Code",{"$f":"VLOOKUP(C3,COUNTRYLIST,4,FALSE)","v":25}]
[null,"Cust Region Lookup",{"$f":"C8","v":25}]
[null,"Partner Location",{"$f":"PARTNERLOCATION","v":0},{"$f":"IF(C10=\"\",C3,C10)","v":0}]
[null,"Ptnr Country Lookup"]
[null,"Ptnr Country Code",{"$f":"IFERROR(VLOOKUP(C10,COUNTRYLIST,2,FALSE),\"\")","v":""},{"$f":"IF(VLOOKUP(D10,COUNTRYLIST,6,FALSE)=TRUE,\"Excluded\",\"\")","v":{"$error":"#N/A"}},"Checks for Excluded Country"]
[null,"Partner Region",{"$f":"IFERROR(VLOOKUP(C10,COUNTRYLIST,3,FALSE),\"\")","v":""},{"$f":"IFERROR(VLOOKUP(C10,COUNTRYLIST,5,FALSE),\"\")","v":""}]
[null,"Ptnr Region Code",{"$f":"IFERROR(VLOOKUP(C10,COUNTRYLIST,4,FALSE),\"\")","v":""}]
[null,"Ptnr Region Lookup",{"$f":"IFERROR(C14,\"\")","v":""}]
[null,"Display CurrencyBox?",{"$f":"IF(C12=\"\",\"\",\nIF(VLOOKUP(C10,COUNTRYLIST,8,FALSE)=TRUE,\"Group A\",\"\"))","v":""},{"$f":"IFERROR(IF(D6=\"No\",\"No\",\nIF(C16=\"Group A\",\"Yes\",\"No\")),\"No\")","v":"No"},"Checks for Group A and drives currency box"]
[null,"Currency Override?",{"$f":"IF(C16=\"Group A\",\"Yes\",\"No\")","v":"No"}]
[null,"CurrencyBox List",{"$f":"VLOOKUP(D18,CURRENCYLIST,2,FALSE)","v":"US Dollar"},{"$f":"IF(D6=\"No\",D7,\"EUR\")","v":"USD"},"This is the customer's currency. HOWEVER if partner location is in Group A then defaults to Euro"]
[null,null,{"$f":"VLOOKUP(D19,CURRENCYLIST,2,FALSE)","v":"US Dollar"},{"$f":"IF(D6=\"No\",D7,D13)","v":"USD"},"This is the partners currency. If no partner box then defaults to customer currency. If currency override uses EUR"]
[null,"Currency Selected",{"$f":"'GP FuseBox'!C20","v":"US Dollar"},{"$f":"IF(AND(C6=\"EEAS\",D10=\"Please select Partner location...\"),\"Customer\",\nIF(AND(C6=\"EEAS\",C17=\"No\"),\"Customer\",\nIF(AND(C6=\"EEAS\",C17=\"Yes\",C20=C19),\"Partner\",\n\"Customer\")))","v":"Customer"},"Indicates which menu selection to use and displays chosen currency"]
[null,"Pricing to use?",{"$f":"IF(AND(C6=\"EEAS\",D10=\"Please select Partner location...\"),\"EUR\",\nIF(AND(C6=\"EEAS\",C17=\"No\"),\"EUR\",\nIF(AND(C6=\"EEAS\",C17=\"Yes\",D21=\"\"),\"EUR\",\nD19)))","v":"USD"},{"$f":"IF(AND(C6=\"EEAS\",C17=\"Yes\",C20=C19),\"DD Override\",\"\")","v":""},"\"DD Override\" changes currency in C21 (used in MasterCalc) to dropdown value"]
[null,"Price List Selected",{"$f":"IF(AND(D20=\"Customer\",D18=\"EUR\"),26,\nIF(AND(D20=\"Customer\",D18<>\"EUR\"),CUSTOMERREGIONLOOKUP,\nIF(D20=\"Partner\",C15,\n286+1)))","v":25},null,"Points to price list. Eurozone = 26"]
[null,"PriceRegionSelected",{"$f":"IF(C8=C22,CRMCUSTOMERREGION,\nIF(CRMSELECTEDCURRENCY=\"EUR\",\"EUROZONE\",CRMSELECTEDPARTNERREGION\n))","v":"United States"},null,"This displays the PriceRegion to look up for pricing. Will either be Customer Region, Partner region or EuroZone "]
[null,null,null,null,"Logic"]
[null,null,null,"1)","If cust is EEAS and \"Select\" message displayed, then EUR","Customer"]
[null,null,null,"2)","If Cust is EEAS and partner chosen with no override then EUR","Customer"]
[null,null,null,"1)","If Cust is EEAS and partner chosen with override then default EUR with option to select ","Customer"]
[null,null,null,"2)","if Cust currency = dropdown value then…","Customer"]
[null,null,null,"1)","if Partner currency = dropdown value then…","Partner"]
[null,null,null,"2)"]
[]
[null,"Pricelist Month",{"$f":"PricelistMonth","v":"April"},null,"Pricelist Month selected on Admin Control Page"]
[null,"Pricelist Year",{"$f":"Pricelistyear","v":2013},null,"Pricelist year selected on Admin Control Page"]
[null,"Publication Date",{"$f":"CONCATENATE(C32,\", \",C33)","v":"April, 2013"},null,"Current Publication Date"]
[]
[null,"Customer Loc Excluded ?",{"$f":"IFERROR(VLOOKUP(CRMCUSTOMERLOCATION,EXCOUNTRYLIST,1,FALSE),FALSE)","v":false},null,"Is Customer Location chosen  an excluded country."]
[null,"Partner Loc Excluded ?",{"$f":"IFERROR(VLOOKUP(CRMPARTNERLOCATION,EXCOUNTRYLIST,1,FALSE),FALSE)","v":false},null,"Is Partner Location chosen  an excluded country."]
[null,"Pricelist Excluded Status",{"$f":"IF(OR(C36<>FALSE,C37<>FALSE),TRUE,FALSE)","v":false},null,"Tests if either Customer or Partner Location chosen is an excluded country. If TRUE then all pricerows on mastercalc set to NOTINCLUDE"]

{"sheet":"CRM Master Calc","index":13,"n_rows":75,"n_cols":12,"rows_kept":75,"cut":false,"hidden":true,"merged":[[5,6,5,11]]}
["Microsoft Dynamics® CRM 2011 Price List"]
[]
[null,"Customer Location:"]
[null,"Partner Location:",null,null,null,{"$f":"CONCATENATE(\"Price List – Effective \", PUBLICATIONDATE)","v":"Price List – Effective April, 2013"}]
[null,"Currency:",null,null,null,"Microsoft Confidential"]
[null,null,null,null,null,null,"PRICE LIST CREATION STUFF"]
["Qty","SKU","Item",{"$f":"'CRM FuseBox'!C21","v":"USD"},"Total","rowtype","Status","LookUp","usbase","Muliplier Applied","Std Multiplier","Ex Multiplier"]
[{"$f":"IF('Dynamics CRM'!A8=\"\",\"\",'Dynamics CRM'!A8)","v":1},{"$f":"IF(HLOOKUP($B$7,CRMPriceLookup,H8-7,FALSE)=\"\",\"\",HLOOKUP($B$7,CRMPriceLookup,H8-7,FALSE))","v":109057076},{"$f":"IF(HLOOKUP(C$7,CRMPriceLookup,$H8-7,FALSE)=\"\",\"\",HLOOKUP(C$7,CRMPriceLookup,$H8-7,FALSE))","v":"Microsoft Dynamics CRM 2011 Server    "},{"$f":"IF(H8=\"\",\"\",\nIF(HLOOKUP(\"US Base Price\",CRMPriceLookup,H8-7,FALSE)=\"OVERRIDE\",J8,\nIF(HLOOKUP(\"Rounding Rule\",CRMPriceLookup,H8-7,FALSE)=-1,ROUND(I8*ROUND(J8,8)/-1,0)*-1,\nIF(HLOOKUP(\"Rounding Rule\",CRMPriceLookup,H8-7,FALSE)=5,ROUND(I8*ROUND(J8,8)/5,0)*5,\nIF(HLOOKUP(\"Rounding Rule\",CRMPriceLookup,H8-7,FALSE)=1,ROUND(I8*ROUND(J8,8)/1,0)*1,\n0)))))","v":4999},{"$f":"A8*D8","v":4999},null,{"$f":"IF(AND(HLOOKUP(CRMCUSTOMERLOCATION,CRMAvailabilityLookUp,$H8-7,FALSE)=1,EXCLUDESTATUS=FALSE),\"Included\",\"Not Included\")","v":"Included"},9,{"$f":"HLOOKUP(\"US Base Price\",CRMPriceLookup,H8-7,FALSE)","v":4999},{"$f":"IF(I8=\"OVERRIDE\",L8,\nIF(L8=\"\",K8,L8))","v":1},{"$f":"HLOOKUP(CRMSELECTEDPRICEREGION,CRMRegionStdMultiplier,2,FALSE)","v":1},{"$f":"IF(HLOOKUP(CRMSELECTEDPRICEREGION,CRMPriceLookup,H8-7,FALSE)=\"\",\"\",HLOOKUP(CRMSELECTEDPRICEREGION,CRMPriceLookup,H8-7,FALSE))","v":""}]
[{"$f":"IF('Dynamics CRM'!A9=\"\",\"\",'Dynamics CRM'!A9)","v":5},{"$f":"IF(HLOOKUP(B$7,CRMPriceLookup,$H9-7,FALSE)=\"\",\"\",HLOOKUP(B$7,CRMPriceLookup,$H9-7,FALSE))","v":109056979},"Microsoft Dynamics CRM 2011 User CAL (Named User)",999,{"$f":"A9*D9","v":4995},null,"Included",10,999,{"$f":"IF(I9=\"OVERRIDE\",L9,\nIF(L9=\"\",K9,L9))","v":1},1,""]
[{"$f":"IF('Dynamics CRM'!A10=\"\",\"\",'Dynamics CRM'!A10)","v":0},109056946,"Microsoft Dynamics CRM 2011 Device CAL (Device)",999,0,null,"Included",11,999,1,1,""]
[{"$f":"IF('Dynamics CRM'!A11=\"\",\"\",'Dynamics CRM'!A11)","v":0},109056958,"Microsoft Dynamics CRM 2011 Full Use Additive User CAL (Named User)     ",700,0,null,"Included",12,700,1,1,""]
[{"$f":"IF('Dynamics CRM'!A12=\"\",\"\",'Dynamics CRM'!A12)","v":0},109056954,"Microsoft Dynamics CRM 2011 Full Use Additive Device CAL     ",700,0,null,"Included",13,700,1,1,""]
[{"$f":"IF('Dynamics CRM'!A13=\"\",\"\",'Dynamics CRM'!A13)","v":0},109056970,"Microsoft Dynamics CRM 2011 Limited User CAL (Named User)              ",299,0,null,"Included",14,299,1,1,""]
[{"$f":"IF('Dynamics CRM'!A14=\"\",\"\",'Dynamics CRM'!A14)","v":0},109056967,"Microsoft Dynamics CRM 2011 Limited Device CAL",299,0,null,"Included",15,299,1,1,""]
[{"$f":"IF('Dynamics CRM'!A15=\"\",\"\",'Dynamics CRM'!A15)","v":0},109057081,"Microsoft Dynamics CRM 2011 Limited Use Additive User CAL",200,0,null,"Included",16,200,1,1,""]
[{"$f":"IF('Dynamics CRM'!A16=\"\",\"\",'Dynamics CRM'!A16)","v":0},109057082,"Microsoft Dynamics CRM 2011 Limited Use Additive Device CAL",200,0,null,"Included",17,200,1,1,""]
[{"$f":"IF('Dynamics CRM'!A17=\"\",\"\",'Dynamics CRM'!A17)","v":0},109057079,"Microsoft Dynamics CRM 2011 Employee Self Service User CAL",99,0,null,"Included",18,99,1,1,""]
[{"$f":"IF('Dynamics CRM'!A18=\"\",\"\",'Dynamics CRM'!A18)","v":0},109057074,"Microsoft Dynamics CRM 2011 Employee Self Service Device CAL",99,0,null,"Included",19,99,1,1,""]
[{"$f":"IF('Dynamics CRM'!A19=\"\",\"\",'Dynamics CRM'!A19)","v":0},109056950,"Microsoft Dynamics CRM 2011 External Connector ",4999,0,null,"Included",20,4999,1,1,""]
[null,null,null,null,null,null,"Included"]
[{"$f":"IF('Dynamics CRM'!A21=\"\",\"\",'Dynamics CRM'!A21)","v":0},109056938,"Language: Arabic",0,0,null,"Included",21,0,1,1,""]
[{"$f":"IF('Dynamics CRM'!A22=\"\",\"\",'Dynamics CRM'!A22)","v":0},109057049,"Language: Portuguese (Brazil)",0,0,null,"Included",22,0,1,1,""]
[{"$f":"IF('Dynamics CRM'!A23=\"\",\"\",'Dynamics CRM'!A23)","v":0},109056982,"Language: Chinese Simplified",0,0,null,"Included",23,0,1,1,""]
[{"$f":"IF('Dynamics CRM'!A24=\"\",\"\",'Dynamics CRM'!A24)","v":0},109056984,"Language: Chinese Traditional",0,0,null,"Included",24,0,1,1,""]
[{"$f":"IF('Dynamics CRM'!A25=\"\",\"\",'Dynamics CRM'!A25)","v":0},109056983,"Language: Chinese (Hong Kong SAR)",0,0,null,"Included",25,0,1,1,""]
[{"$f":"IF('Dynamics CRM'!A26=\"\",\"\",'Dynamics CRM'!A26)","v":0},109056985,"Language: Czech",0,0,null,"Included",26,0,1,1,""]
[{"$f":"IF('Dynamics CRM'!A27=\"\",\"\",'Dynamics CRM'!A27)","v":0},109056986,"Language: Danish",0,0,null,"Included",27,0,1,1,""]
[{"$f":"IF('Dynamics CRM'!A28=\"\",\"\",'Dynamics CRM'!A28)","v":0},109056948,"Language: Dutch",0,0,null,"Included",28,0,1,1,""]
[{"$f":"IF('Dynamics CRM'!A29=\"\",\"\",'Dynamics CRM'!A29)","v":0},109056949,"Language: English",0,0,null,"Included",29,0,1,1,""]
[{"$f":"IF('Dynamics CRM'!A30=\"\",\"\",'Dynamics CRM'!A30)","v":0},109056952,"Language: Finnish",0,0,null,"Included",30,0,1,1,""]
[{"$f":"IF('Dynamics CRM'!A31=\"\",\"\",'Dynamics CRM'!A31)","v":0},109056953,"Language: French",0,0,null,"Included",31,0,1,1,""]
[{"$f":"IF('Dynamics CRM'!A32=\"\",\"\",'Dynamics CRM'!A32)","v":0},109056960,"Language: German",0,0,null,"Included",32,0,1,1,""]
[{"$f":"IF('Dynamics CRM'!A33=\"\",\"\",'Dynamics CRM'!A33)","v":0},109056961,"Language: Greek",0,0,null,"Included",33,0,1,1,""]
[{"$f":"IF('Dynamics CRM'!A34=\"\",\"\",'Dynamics CRM'!A34)","v":0},109056962,"Language: Hebrew",0,0,null,"Included",34,0,1,1,""]
[{"$f":"IF('Dynamics CRM'!A35=\"\",\"\",'Dynamics CRM'!A35)","v":0},109056963,"Language: Hungarian",0,0,null,"Included",35,0,1,1,""]
[{"$f":"IF('Dynamics CRM'!A36=\"\",\"\",'Dynamics CRM'!A36)","v":0},109056964,"Language: Italian",0,0,null,"Included",36,0,1,1,""]
[{"$f":"IF('Dynamics CRM'!A37=\"\",\"\",'Dynamics CRM'!A37)","v":0},109056965,"Language: Japanese",0,0,null,"Included",37,0,1,1,""]
[{"$f":"IF('Dynamics CRM'!A38=\"\",\"\",'Dynamics CRM'!A38)","v":0},109056966,"Language: Korean",0,0,null,"Included",38,0,1,1,""]
[{"$f":"IF('Dynamics CRM'!A39=\"\",\"\",'Dynamics CRM'!A39)","v":0},109056972,"Language: Norwegian (Bokmal)",0,0,null,"Included",39,0,1,1,""]
[{"$f":"IF('Dynamics CRM'!A40=\"\",\"\",'Dynamics CRM'!A40)","v":0},109056973,"Language: Polish",0,0,null,"Included",40,0,1,1,""]
[{"$f":"IF('Dynamics CRM'!A41=\"\",\"\",'Dynamics CRM'!A41)","v":0},109056974,"Language: Portuguese (Portugal)",0,0,null,"Included",41,0,1,1,""]
[{"$f":"IF('Dynamics CRM'!A42=\"\",\"\",'Dynamics CRM'!A42)","v":0},109056975,"Language: Russian",0,0,null,"Included",42,0,1,1,""]
[{"$f":"IF('Dynamics CRM'!A43=\"\",\"\",'Dynamics CRM'!A43)","v":0},109056976,"Language: Spanish",0,0,null,"Included",43,0,1,1,""]
[{"$f":"IF('Dynamics CRM'!A44=\"\",\"\",'Dynamics CRM'!A44)","v":0},109056977,"Language: Swedish",0,0,null,"Included",44,0,1,1,""]
[{"$f":"IF('Dynamics CRM'!A45=\"\",\"\",'Dynamics CRM'!A45)","v":0},109056978,"Language: Turkish",0,0,null,"Included",45,0,1,1,""]
[null,null,null,null,null,null,{"$f":"IF(EXCLUDESTATUS=FALSE,\"Included\",\"Not Included\")","v":"Included"}]
[null,null,null,null,null,null,"Included"]
["CRM Software License Fee Sub-Total",null,null,null,{"$f":"SUM(E8:E45)","v":9994},null,"Included"]
[null,null,null,null,null,null,"Included"]
["Enhancement Plan (New customers must choose one of the following programs)",null,null,null,null,null,"Included"]
["Select",null,"Plan Name","Rate","Fee",null,"Included"]
[{"$f":"IF('Dynamics CRM'!A52=\"\",\"\",'Dynamics CRM'!A52)","v":0},{"$f":"IF(HLOOKUP(B$7,CRMPriceLookup,$H52-7,FALSE)=\"\",\"\",HLOOKUP(B$7,CRMPriceLookup,$H52-7,FALSE))","v":""},"Business Ready Enhancement Plan",{"$f":"IF(H52=\"\",\"\",\nIF(HLOOKUP(\"US Base Price\",CRMPriceLookup,H52-7,FALSE)=\"OVERRIDE\",J52,\nIF(HLOOKUP(\"Rounding Rule\",CRMPriceLookup,H52-7,FALSE)=-1,ROUND(I52*ROUND(J52,8)/-1,0)*-1,\nIF(HLOOKUP(\"Rounding Rule\",CRMPriceLookup,H52-7,FALSE)=5,ROUND(I52*ROUND(J52,8)/5,0)*5,\nIF(HLOOKUP(\"Rounding Rule\",CRMPriceLookup,H52-7,FALSE)=1,ROUND(I52*ROUND(J52,8)/1,0)*1,\n0)))))","v":0.16},{"$f":"IFERROR(A52*D52*E48,0)","v":0},null,{"$f":"IF(AND(HLOOKUP(CRMCUSTOMERLOCATION,CRMAvailabilityLookUp,$H52-7,FALSE)=1,EXCLUDESTATUS=FALSE),\"Included\",\"Not Included\")","v":"Included"},46,{"$f":"HLOOKUP(\"US Base Price\",CRMPriceLookup,H52-7,FALSE)","v":"OVERRIDE"},0.16,{"$f":"HLOOKUP(CRMSELECTEDPRICEREGION,CRMRegionStdMultiplier,2,FALSE)","v":1},{"$f":"IF(HLOOKUP(CRMSELECTEDPRICEREGION,CRMPriceLookup,H52-7,FALSE)=\"\",\"\",HLOOKUP(CRMSELECTEDPRICEREGION,CRMPriceLookup,H52-7,FALSE))","v":0.16}]
[{"$f":"IF('Dynamics CRM'!A53=\"\",\"\",'Dynamics CRM'!A53)","v":0},"","Three Year Business Ready Enhancement Plan",{"$f":"IF(H53=\"\",\"\",\nIF(HLOOKUP(\"US Base Price\",CRMPriceLookup,H53-7,FALSE)=\"OVERRIDE\",J53,\nIF(HLOOKUP(\"Rounding Rule\",CRMPriceLookup,H53-7,FALSE)=-1,ROUND(I53*ROUND(J53,8)/-1,0)*-1,\nIF(HLOOKUP(\"Rounding Rule\",CRMPriceLookup,H53-7,FALSE)=5,ROUND(I53*ROUND(J53,8)/5,0)*5,\nIF(HLOOKUP(\"Rounding Rule\",CRMPriceLookup,H53-7,FALSE)=1,ROUND(I53*ROUND(J53,8)/1,0)*1,\n0)))))","v":0.16},{"$f":"IFERROR(A53*D53*E48,0)","v":0},null,{"$f":"IF(AND(HLOOKUP(CRMCUSTOMERLOCATION,CRMAvailabilityLookUp,$H53-7,FALSE)=1,EXCLUDESTATUS=FALSE),\"Included\",\"Not Included\")","v":"Included"},47,{"$f":"HLOOKUP(\"US Base Price\",CRMPriceLookup,H53-7,FALSE)","v":"OVERRIDE"},0.16,{"$f":"HLOOKUP(CRMSELECTEDPRICEREGION,CRMRegionStdMultiplier,2,FALSE)","v":1},{"$f":"IF(HLOOKUP(CRMSELECTEDPRICEREGION,CRMPriceLookup,H53-7,FALSE)=\"\",\"\",HLOOKUP(CRMSELECTEDPRICEREGION,CRMPriceLookup,H53-7,FALSE))","v":0.16}]
[{"$f":"IF('Dynamics CRM'!A54=\"\",\"\",'Dynamics CRM'!A54)","v":0},"","Business Ready Advantage Plan",{"$f":"IF(H54=\"\",\"\",\nIF(HLOOKUP(\"US Base Price\",CRMPriceLookup,H54-7,FALSE)=\"OVERRIDE\",J54,\nIF(HLOOKUP(\"Rounding Rule\",CRMPriceLookup,H54-7,FALSE)=-1,ROUND(I54*ROUND(J54,8)/-1,0)*-1,\nIF(HLOOKUP(\"Rounding Rule\",CRMPriceLookup,H54-7,FALSE)=5,ROUND(I54*ROUND(J54,8)/5,0)*5,\nIF(HLOOKUP(\"Rounding Rule\",CRMPriceLookup,H54-7,FALSE)=1,ROUND(I54*ROUND(J54,8)/1,0)*1,\n0)))))","v":0.18},{"$f":"IFERROR(A54*D54*E48,0)","v":0},null,{"$f":"IF(AND(HLOOKUP(CRMCUSTOMERLOCATION,CRMAvailabilityLookUp,$H54-7,FALSE)=1,EXCLUDESTATUS=FALSE),\"Included\",\"Not Included\")","v":"Included"},48,{"$f":"HLOOKUP(\"US Base Price\",CRMPriceLookup,H54-7,FALSE)","v":"OVERRIDE"},0.18,{"$f":"HLOOKUP(CRMSELECTEDPRICEREGION,CRMRegionStdMultiplier,2,FALSE)","v":1},{"$f":"IF(HLOOKUP(CRMSELECTEDPRICEREGION,CRMPriceLookup,H54-7,FALSE)=\"\",\"\",HLOOKUP(CRMSELECTEDPRICEREGION,CRMPriceLookup,H54-7,FALSE))","v":0.18}]
[{"$f":"IF('Dynamics CRM'!A55=\"\",\"\",'Dynamics CRM'!A55)","v":0},"","Business Ready Advantage Plus Plan",{"$f":"IF(H55=\"\",\"\",\nIF(HLOOKUP(\"US Base Price\",CRMPriceLookup,H55-7,FALSE)=\"OVERRIDE\",J55,\nIF(HLOOKUP(\"Rounding Rule\",CRMPriceLookup,H55-7,FALSE)=-1,ROUND(I55*ROUND(J55,8)/-1,0)*-1,\nIF(HLOOKUP(\"Rounding Rule\",CRMPriceLookup,H55-7,FALSE)=5,ROUND(I55*ROUND(J55,8)/5,0)*5,\nIF(HLOOKUP(\"Rounding Rule\",CRMPriceLookup,H55-7,FALSE)=1,ROUND(I55*ROUND(J55,8)/1,0)*1,\n0)))))","v":0.25},{"$f":"IFERROR(A55*D55*E48,0)","v":0},null,{"$f":"IF(AND(HLOOKUP(CRMCUSTOMERLOCATION,CRMAvailabilityLookUp,$H55-7,FALSE)=1,EXCLUDESTATUS=FALSE),\"Included\",\"Not Included\")","v":"Included"},49,{"$f":"HLOOKUP(\"US Base Price\",CRMPriceLookup,H55-7,FALSE)","v":"OVERRIDE"},0.25,{"$f":"HLOOKUP(CRMSELECTEDPRICEREGION,CRMRegionStdMultiplier,2,FALSE)","v":1},{"$f":"IF(HLOOKUP(CRMSELECTEDPRICEREGION,CRMPriceLookup,H55-7,FALSE)=\"\",\"\",HLOOKUP(CRMSELECTEDPRICEREGION,CRMPriceLookup,H55-7,FALSE))","v":0.25}]
[{"$f":"IF('Dynamics CRM'!A56=\"\",\"\",'Dynamics CRM'!A56)","v":0},"","Three Year Business Ready Advantage Plan",{"$f":"IF(H56=\"\",\"\",\nIF(HLOOKUP(\"US Base Price\",CRMPriceLookup,H56-7,FALSE)=\"OVERRIDE\",J56,\nIF(HLOOKUP(\"Rounding Rule\",CRMPriceLookup,H56-7,FALSE)=-1,ROUND(I56*ROUND(J56,8)/-1,0)*-1,\nIF(HLOOKUP(\"Rounding Rule\",CRMPriceLookup,H56-7,FALSE)=5,ROUND(I56*ROUND(J56,8)/5,0)*5,\nIF(HLOOKUP(\"Rounding Rule\",CRMPriceLookup,H56-7,FALSE)=1,ROUND(I56*ROUND(J56,8)/1,0)*1,\n0)))))","v":0.18},{"$f":"IFERROR(A56*D56*E48,0)","v":0},null,{"$f":"IF(AND(HLOOKUP(CRMCUSTOMERLOCATION,CRMAvailabilityLookUp,$H56-7,FALSE)=1,EXCLUDESTATUS=FALSE),\"Included\",\"Not Included\")","v":"Included"},50,{"$f":"HLOOKUP(\"US Base Price\",CRMPriceLookup,H56-7,FALSE)","v":"OVERRIDE"},0.18,{"$f":"HLOOKUP(CRMSELECTEDPRICEREGION,CRMRegionStdMultiplier,2,FALSE)","v":1},{"$f":"IF(HLOOKUP(CRMSELECTEDPRICEREGION,CRMPriceLookup,H56-7,FALSE)=\"\",\"\",HLOOKUP(CRMSELECTEDPRICEREGION,CRMPriceLookup,H56-7,FALSE))","v":0.18}]
["CRM Enhancement Fee Sub-Total",null,null,null,{"$f":"SUM(E52:E56)","v":0},null,{"$f":"IF(EXCLUDESTATUS=FALSE,\"Included\",\"Not Included\")","v":"Included"}]
["For more information on Service Plans Click Here",null,null,null,null,null,"Included"]
["CRM Total Fees",null,null,null,{"$f":"E57+E48","v":9994},null,"Included"]
[null,null,null,null,null,null,"Included"]
[null,null,null,null,null,null,"Included"]
["* An Enhancement Plan is Required. ",null,null,null,null,null,"Included"]
[null,null,null,null,null,null,"Included"]
["Links to Partner Training:",null,null,null,null,null,"Included"]
[null,"Microsoft Dynamics CRM 2011 Pricing and Licensing Training (On-Premise and SPLA)",null,null,null,null,"Included"]
[null,null,null,null,null,null,"Included"]
["System Requirements:",null,null,null,null,null,"Included"]
[null,"Microsoft Dynamics CRM 2011 System Requirements and Required Components",null,null,null,null,"Included"]
[null,null,null,null,null,null,"Included"]
["CRM Orders with Dynamics ERP",null,null,null,null,null,"Included"]
[null,"Customers that own Business Value Licensing (AX 2012), the Business Ready Licensing Advanced Management edition, or the Module Based Licensing Professional edition of Microsoft Dynamics NAV, Microsoft Dynamics AX, Microsoft Dynamics GP, or Microsoft Dynamics SL receive their first Microsoft Dynamics CRM 2011 Server for free as long as they acquire it through Order Central.  This offer does not apply to purchases made through Volume Licensing",null,null,null,null,"Included"]
[null,null,null,null,null,null,"Included"]
["This document is intended for general information purposes only, and we have taken due care in its preparation. All embedded functionality used to facilitate price calculations is provided AS IS. Any risk arising from the use of the information shall rest with the recipient and nothing herein shall be construed as constituting any kind of warranty or representation, express, implied or statutory.  Users are responsible for information that is input using the pricing calculator embedded in the offline pricelist.  Under certain circumstances the figures resulting from the applied pricing calculations embedded in the price list, which are shown for your convenience in this pricelist, may differ from those reflected in the Order Summary Page in Order Central. In these scenarios, the figures shown in the Order Summary Page will control.",null,null,null,null,null,"Included"]
[null,null,null,null,null,null,"Included"]
["European Union/European Free Trade Association policy: Upward price adjustments due to currency alignment are not subject to the standard 90-day Solution Provider Agreement notification policy.  Notice of currency alignment changes will be published at least 30 days in advance of the effective date.  The Euro price list is the official price list for all reference purposes for customers located in the European Union/European Free Trade Association.  Microsoft’s European Operating Centre (EOC) supports five additional currencies for pricing purposes:  British Pound, Danish Krone, Norwegian Krone, Swedish Krona, and Swiss Franc.  Price lists reflected in these local currencies are listed for your convenience only.",null,null,null,null,null,{"$f":"IF('CRM FuseBox'!D6=\"Yes\", \"Included\",\"Not Included\")","v":"Not Included"}]

{"sheet":"CRM Product Data","index":14,"n_rows":48,"n_cols":40,"rows_kept":48,"cut":false,"hidden":true,"merged":[[1,37,1,39],[1,41,1,43]]}
[]
[null,null,null,null,"Lookup",1,2,3,4,5,6,7,8,9,10,11,12,13,14,15,16,17,18,19,20,21,22,23,24,25,26,27,28,29,30,31,null,"ROUNDING RULES LIST"]
[null,null,null,null,"Region","Africa","APOC United States","Australia","Canada","Central Asia 1 - CEE 1","Central Asia 2 - CEE 2","Chile","China","Colombia","Eastern Europe 1","Eastern Europe 2","India","Japan","Latam Caribbean","Latam PR/BM/CI/VI","Mexico","Middle East","New Zealand","Rest of Latam","Russia","Serbia","South Africa","South East Asia","Turkey","United States","Eurozone","Denmark2","Norway2","Sweden2","Switzerland2","United Kingdom2",null,"Rule","Rounding Rule list","Driver"]
[null,null,null,null,"Std Multiplier",1,1,1.4490000000000001,1.3360000000000001,1,1,1,8.3000000000000007,1,1,1,52.25,119,1,1,1,1,1.724,1,33,1,1,1,1,1,1.0706,{"$f":"ROUND($AE$4*DKKEURORATE,4)","v":7.9701000000000004},{"$f":"ROUND($AE$4*NOKEURORATE,4)","v":8.2805999999999997},{"$f":"ROUND($AE$4*SEKEURORATE,4)","v":9.7933000000000003},{"$f":"ROUND($AE$4*CHFEURORATE,4)","v":1.292},{"$f":"ROUND($AE$4*GBPEURORATE,4)","v":0.8448},null,1,"Round up to nearest whole number",1]
["Lookup",1,2,3,4,5,6,7,8,9,10,11,12,13,14,15,16,17,18,19,20,21,22,23,24,26,27,28,29,30,31,32,33,34,35,36,null,2,"Round to nearest whole 5",5]
[1,"SKU","Item","US Base Price","Rounding Rule","Africa","APOC United States","Australia","Canada","Central Asia 1 - CEE 1","Central Asia 2 - CEE 2","Chile","China","Colombia","Eastern Europe 1","Eastern Europe 2","India","Japan","Latam Caribbean","Latam PR/BM/CI/VI","Mexico","Middle East","New Zealand","Rest of Latam","Russia","Serbia","South Africa","South East Asia","Turkey","United States","Eurozone","Denmark2","Norway2","Sweden2","Switzerland2","United Kingdom2",null,3,"Round to nearest 2 decimal places",-1]
[2,109057076,"Microsoft Dynamics CRM 2011 Server    ",4999,1,null,null,null,null,null,null,null,null,null,null,null,null,null,null,null,null,null,null,null,null,null,null,null,null,null,null,{"$f":"IF(CRMPRODUCTINFOTABLE[[#This Row],[Eurozone]]<>\"\",ROUND(CRMPRODUCTINFOTABLE[[#This Row],[Eurozone]]*DKKEURORATE,4),\"\")","v":""},{"$f":"IF(CRMPRODUCTINFOTABLE[[#This Row],[Eurozone]]<>\"\",ROUND(CRMPRODUCTINFOTABLE[[#This Row],[Eurozone]]*NOKEURORATE,4),\"\")","v":""},{"$f":"IF(CRMPRODUCTINFOTABLE[[#This Row],[Eurozone]]<>\"\",ROUND(CRMPRODUCTINFOTABLE[[#This Row],[Eurozone]]*SEKEURORATE,4),\"\")","v":""},{"$f":"IF(CRMPRODUCTINFOTABLE[[#This Row],[Eurozone]]<>\"\",ROUND(CRMPRODUCTINFOTABLE[[#This Row],[Eurozone]]*CHFEURORATE,4),\"\")","v":""},{"$f":"IF(CRMPRODUCTINFOTABLE[[#This Row],[Eurozone]]<>\"\",ROUND(CRMPRODUCTINFOTABLE[[#This Row],[Eurozone]]*GBPEURORATE,4),\"\")","v":""}]
[3,109056979,"Microsoft Dynamics CRM 2011 User CAL (Named User)",999,1,null,null,null,null,null,null,null,null,null,null,null,null,null,null,null,null,null,null,null,null,null,null,null,null,null,null,{"$f":"IF(CRMPRODUCTINFOTABLE[[#This Row],[Eurozone]]<>\"\",ROUND(CRMPRODUCTINFOTABLE[[#This Row],[Eurozone]]*DKKEURORATE,4),\"\")","v":""},{"$f":"IF(CRMPRODUCTINFOTABLE[[#This Row],[Eurozone]]<>\"\",ROUND(CRMPRODUCTINFOTABLE[[#This Row],[Eurozone]]*NOKEURORATE,4),\"\")","v":""},{"$f":"IF(CRMPRODUCTINFOTABLE[[#This Row],[Eurozone]]<>\"\",ROUND(CRMPRODUCTINFOTABLE[[#This Row],[Eurozone]]*SEKEURORATE,4),\"\")","v":""},{"$f":"IF(CRMPRODUCTINFOTABLE[[#This Row],[Eurozone]]<>\"\",ROUND(CRMPRODUCTINFOTABLE[[#This Row],[Eurozone]]*CHFEURORATE,4),\"\")","v":""},{"$f":"IF(CRMPRODUCTINFOTABLE[[#This Row],[Eurozone]]<>\"\",ROUND(CRMPRODUCTINFOTABLE[[#This Row],[Eurozone]]*GBPEURORATE,4),\"\")","v":""}]
[4,109056946,"Microsoft Dynamics CRM 2011 Device CAL (Device)",999,1,null,null,null,null,null,null,null,null,null,null,null,null,null,null,null,null,null,null,null,null,null,null,null,null,null,null,{"$f":"IF(CRMPRODUCTINFOTABLE[[#This Row],[Eurozone]]<>\"\",ROUND(CRMPRODUCTINFOTABLE[[#This Row],[Eurozone]]*DKKEURORATE,4),\"\")","v":""},{"$f":"IF(CRMPRODUCTINFOTABLE[[#This Row],[Eurozone]]<>\"\",ROUND(CRMPRODUCTINFOTABLE[[#This Row],[Eurozone]]*NOKEURORATE,4),\"\")","v":""},{"$f":"IF(CRMPRODUCTINFOTABLE[[#This Row],[Eurozone]]<>\"\",ROUND(CRMPRODUCTINFOTABLE[[#This Row],[Eurozone]]*SEKEURORATE,4),\"\")","v":""},{"$f":"IF(CRMPRODUCTINFOTABLE[[#This Row],[Eurozone]]<>\"\",ROUND(CRMPRODUCTINFOTABLE[[#This Row],[Eurozone]]*CHFEURORATE,4),\"\")","v":""},{"$f":"IF(CRMPRODUCTINFOTABLE[[#This Row],[Eurozone]]<>\"\",ROUND(CRMPRODUCTINFOTABLE[[#This Row],[Eurozone]]*GBPEURORATE,4),\"\")","v":""}]
[5,109056958,"Microsoft Dynamics CRM 2011 Full Use Additive User CAL (Named User)     ",700,1,null,null,null,null,null,null,null,null,null,null,null,null,null,null,null,null,null,null,null,null,null,null,null,null,null,null,{"$f":"IF(CRMPRODUCTINFOTABLE[[#This Row],[Eurozone]]<>\"\",ROUND(CRMPRODUCTINFOTABLE[[#This Row],[Eurozone]]*DKKEURORATE,4),\"\")","v":""},{"$f":"IF(CRMPRODUCTINFOTABLE[[#This Row],[Eurozone]]<>\"\",ROUND(CRMPRODUCTINFOTABLE[[#This Row],[Eurozone]]*NOKEURORATE,4),\"\")","v":""},{"$f":"IF(CRMPRODUCTINFOTABLE[[#This Row],[Eurozone]]<>\"\",ROUND(CRMPRODUCTINFOTABLE[[#This Row],[Eurozone]]*SEKEURORATE,4),\"\")","v":""},{"$f":"IF(CRMPRODUCTINFOTABLE[[#This Row],[Eurozone]]<>\"\",ROUND(CRMPRODUCTINFOTABLE[[#This Row],[Eurozone]]*CHFEURORATE,4),\"\")","v":""},{"$f":"IF(CRMPRODUCTINFOTABLE[[#This Row],[Eurozone]]<>\"\",ROUND(CRMPRODUCTINFOTABLE[[#This Row],[Eurozone]]*GBPEURORATE,4),\"\")","v":""}]
[6,109056954,"Microsoft Dynamics CRM 2011 Full Use Additive Device CAL     ",700,1,null,null,null,null,null,null,null,null,null,null,null,null,null,null,null,null,null,null,null,null,null,null,null,null,null,null,{"$f":"IF(CRMPRODUCTINFOTABLE[[#This Row],[Eurozone]]<>\"\",ROUND(CRMPRODUCTINFOTABLE[[#This Row],[Eurozone]]*DKKEURORATE,4),\"\")","v":""},{"$f":"IF(CRMPRODUCTINFOTABLE[[#This Row],[Eurozone]]<>\"\",ROUND(CRMPRODUCTINFOTABLE[[#This Row],[Eurozone]]*NOKEURORATE,4),\"\")","v":""},{"$f":"IF(CRMPRODUCTINFOTABLE[[#This Row],[Eurozone]]<>\"\",ROUND(CRMPRODUCTINFOTABLE[[#This Row],[Eurozone]]*SEKEURORATE,4),\"\")","v":""},{"$f":"IF(CRMPRODUCTINFOTABLE[[#This Row],[Eurozone]]<>\"\",ROUND(CRMPRODUCTINFOTABLE[[#This Row],[Eurozone]]*CHFEURORATE,4),\"\")","v":""},{"$f":"IF(CRMPRODUCTINFOTABLE[[#This Row],[Eurozone]]<>\"\",ROUND(CRMPRODUCTINFOTABLE[[#This Row],[Eurozone]]*GBPEURORATE,4),\"\")","v":""}]
[7,109056970,"Microsoft Dynamics CRM 2011 Limited User CAL (Named User)              ",299,1,null,null,null,null,null,null,null,null,null,null,null,null,null,null,null,null,null,null,null,null,null,null,null,null,null,null,{"$f":"IF(CRMPRODUCTINFOTABLE[[#This Row],[Eurozone]]<>\"\",ROUND(CRMPRODUCTINFOTABLE[[#This Row],[Eurozone]]*DKKEURORATE,4),\"\")","v":""},{"$f":"IF(CRMPRODUCTINFOTABLE[[#This Row],[Eurozone]]<>\"\",ROUND(CRMPRODUCTINFOTABLE[[#This Row],[Eurozone]]*NOKEURORATE,4),\"\")","v":""},{"$f":"IF(CRMPRODUCTINFOTABLE[[#This Row],[Eurozone]]<>\"\",ROUND(CRMPRODUCTINFOTABLE[[#This Row],[Eurozone]]*SEKEURORATE,4),\"\")","v":""},{"$f":"IF(CRMPRODUCTINFOTABLE[[#This Row],[Eurozone]]<>\"\",ROUND(CRMPRODUCTINFOTABLE[[#This Row],[Eurozone]]*CHFEURORATE,4),\"\")","v":""},{"$f":"IF(CRMPRODUCTINFOTABLE[[#This Row],[Eurozone]]<>\"\",ROUND(CRMPRODUCTINFOTABLE[[#This Row],[Eurozone]]*GBPEURORATE,4),\"\")","v":""}]
[8,109056967,"Microsoft Dynamics CRM 2011 Limited Device CAL",299,1,null,null,null,null,null,null,null,null,null,null,null,null,null,null,null,null,null,null,null,null,null,null,null,null,null,null,{"$f":"IF(CRMPRODUCTINFOTABLE[[#This Row],[Eurozone]]<>\"\",ROUND(CRMPRODUCTINFOTABLE[[#This Row],[Eurozone]]*DKKEURORATE,4),\"\")","v":""},{"$f":"IF(CRMPRODUCTINFOTABLE[[#This Row],[Eurozone]]<>\"\",ROUND(CRMPRODUCTINFOTABLE[[#This Row],[Eurozone]]*NOKEURORATE,4),\"\")","v":""},{"$f":"IF(CRMPRODUCTINFOTABLE[[#This Row],[Eurozone]]<>\"\",ROUND(CRMPRODUCTINFOTABLE[[#This Row],[Eurozone]]*SEKEURORATE,4),\"\")","v":""},{"$f":"IF(CRMPRODUCTINFOTABLE[[#This Row],[Eurozone]]<>\"\",ROUND(CRMPRODUCTINFOTABLE[[#This Row],[Eurozone]]*CHFEURORATE,4),\"\")","v":""},{"$f":"IF(CRMPRODUCTINFOTABLE[[#This Row],[Eurozone]]<>\"\",ROUND(CRMPRODUCTINFOTABLE[[#This Row],[Eurozone]]*GBPEURORATE,4),\"\")","v":""}]
[9,109057081,"Microsoft Dynamics CRM 2011 Limited Use Additive User CAL",200,1,null,null,null,null,null,null,null,null,null,null,null,null,null,null,null,null,null,null,null,null,null,null,null,null,null,null,{"$f":"IF(CRMPRODUCTINFOTABLE[[#This Row],[Eurozone]]<>\"\",ROUND(CRMPRODUCTINFOTABLE[[#This Row],[Eurozone]]*DKKEURORATE,4),\"\")","v":""},{"$f":"IF(CRMPRODUCTINFOTABLE[[#This Row],[Eurozone]]<>\"\",ROUND(CRMPRODUCTINFOTABLE[[#This Row],[Eurozone]]*NOKEURORATE,4),\"\")","v":""},{"$f":"IF(CRMPRODUCTINFOTABLE[[#This Row],[Eurozone]]<>\"\",ROUND(CRMPRODUCTINFOTABLE[[#This Row],[Eurozone]]*SEKEURORATE,4),\"\")","v":""},{"$f":"IF(CRMPRODUCTINFOTABLE[[#This Row],[Eurozone]]<>\"\",ROUND(CRMPRODUCTINFOTABLE[[#This Row],[Eurozone]]*CHFEURORATE,4),\"\")","v":""},{"$f":"IF(CRMPRODUCTINFOTABLE[[#This Row],[Eurozone]]<>\"\",ROUND(CRMPRODUCTINFOTABLE[[#This Row],[Eurozone]]*GBPEURORATE,4),\"\")","v":""}]
[10,109057082,"Microsoft Dynamics CRM 2011 Limited Use Additive Device CAL",200,1,null,null,null,null,null,null,null,null,null,null,null,null,null,null,null,null,null,null,null,null,null,null,null,null,null,null,{"$f":"IF(CRMPRODUCTINFOTABLE[[#This Row],[Eurozone]]<>\"\",ROUND(CRMPRODUCTINFOTABLE[[#This Row],[Eurozone]]*DKKEURORATE,4),\"\")","v":""},{"$f":"IF(CRMPRODUCTINFOTABLE[[#This Row],[Eurozone]]<>\"\",ROUND(CRMPRODUCTINFOTABLE[[#This Row],[Eurozone]]*NOKEURORATE,4),\"\")","v":""},{"$f":"IF(CRMPRODUCTINFOTABLE[[#This Row],[Eurozone]]<>\"\",ROUND(CRMPRODUCTINFOTABLE[[#This Row],[Eurozone]]*SEKEURORATE,4),\"\")","v":""},{"$f":"IF(CRMPRODUCTINFOTABLE[[#This Row],[Eurozone]]<>\"\",ROUND(CRMPRODUCTINFOTABLE[[#This Row],[Eurozone]]*CHFEURORATE,4),\"\")","v":""},{"$f":"IF(CRMPRODUCTINFOTABLE[[#This Row],[Eurozone]]<>\"\",ROUND(CRMPRODUCTINFOTABLE[[#This Row],[Eurozone]]*GBPEURORATE,4),\"\")","v":""}]
[11,109057079,"Microsoft Dynamics CRM 2011 Employee Self Service User CAL",99,1,null,null,null,null,null,null,null,null,null,null,null,null,null,null,null,null,null,null,null,null,null,null,null,null,null,null,{"$f":"IF(CRMPRODUCTINFOTABLE[[#This Row],[Eurozone]]<>\"\",ROUND(CRMPRODUCTINFOTABLE[[#This Row],[Eurozone]]*DKKEURORATE,4),\"\")","v":""},{"$f":"IF(CRMPRODUCTINFOTABLE[[#This Row],[Eurozone]]<>\"\",ROUND(CRMPRODUCTINFOTABLE[[#This Row],[Eurozone]]*NOKEURORATE,4),\"\")","v":""},{"$f":"IF(CRMPRODUCTINFOTABLE[[#This Row],[Eurozone]]<>\"\",ROUND(CRMPRODUCTINFOTABLE[[#This Row],[Eurozone]]*SEKEURORATE,4),\"\")","v":""},{"$f":"IF(CRMPRODUCTINFOTABLE[[#This Row],[Eurozone]]<>\"\",ROUND(CRMPRODUCTINFOTABLE[[#This Row],[Eurozone]]*CHFEURORATE,4),\"\")","v":""},{"$f":"IF(CRMPRODUCTINFOTABLE[[#This Row],[Eurozone]]<>\"\",ROUND(CRMPRODUCTINFOTABLE[[#This Row],[Eurozone]]*GBPEURORATE,4),\"\")","v":""}]
[12,109057074,"Microsoft Dynamics CRM 2011 Employee Self Service Device CAL",99,1,null,null,null,null,null,null,null,null,null,null,null,null,null,null,null,null,null,null,null,null,null,null,null,null,null,null,{"$f":"IF(CRMPRODUCTINFOTABLE[[#This Row],[Eurozone]]<>\"\",ROUND(CRMPRODUCTINFOTABLE[[#This Row],[Eurozone]]*DKKEURORATE,4),\"\")","v":""},{"$f":"IF(CRMPRODUCTINFOTABLE[[#This Row],[Eurozone]]<>\"\",ROUND(CRMPRODUCTINFOTABLE[[#This Row],[Eurozone]]*NOKEURORATE,4),\"\")","v":""},{"$f":"IF(CRMPRODUCTINFOTABLE[[#This Row],[Eurozone]]<>\"\",ROUND(CRMPRODUCTINFOTABLE[[#This Row],[Eurozone]]*SEKEURORATE,4),\"\")","v":""},{"$f":"IF(CRMPRODUCTINFOTABLE[[#This Row],[Eurozone]]<>\"\",ROUND(CRMPRODUCTINFOTABLE[[#This Row],[Eurozone]]*CHFEURORATE,4),\"\")","v":""},{"$f":"IF(CRMPRODUCTINFOTABLE[[#This Row],[Eurozone]]<>\"\",ROUND(CRMPRODUCTINFOTABLE[[#This Row],[Eurozone]]*GBPEURORATE,4),\"\")","v":""}]
[13,109056950,"Microsoft Dynamics CRM 2011 External Connector ",4999,1,null,null,null,null,null,null,null,null,null,null,null,null,null,null,null,null,null,null,null,null,null,null,null,null,null,null,{"$f":"IF(CRMPRODUCTINFOTABLE[[#This Row],[Eurozone]]<>\"\",ROUND(CRMPRODUCTINFOTABLE[[#This Row],[Eurozone]]*DKKEURORATE,4),\"\")","v":""},{"$f":"IF(CRMPRODUCTINFOTABLE[[#This Row],[Eurozone]]<>\"\",ROUND(CRMPRODUCTINFOTABLE[[#This Row],[Eurozone]]*NOKEURORATE,4),\"\")","v":""},{"$f":"IF(CRMPRODUCTINFOTABLE[[#This Row],[Eurozone]]<>\"\",ROUND(CRMPRODUCTINFOTABLE[[#This Row],[Eurozone]]*SEKEURORATE,4),\"\")","v":""},{"$f":"IF(CRMPRODUCTINFOTABLE[[#This Row],[Eurozone]]<>\"\",ROUND(CRMPRODUCTINFOTABLE[[#This Row],[Eurozone]]*CHFEURORATE,4),\"\")","v":""},{"$f":"IF(CRMPRODUCTINFOTABLE[[#This Row],[Eurozone]]<>\"\",ROUND(CRMPRODUCTINFOTABLE[[#This Row],[Eurozone]]*GBPEURORATE,4),\"\")","v":""}]
[14,109056938,"Language: Arabic",0,1,null,null,null,null,null,null,null,null,null,null,null,null,null,null,null,null,null,null,null,null,null,null,null,null,null,null,{"$f":"IF(CRMPRODUCTINFOTABLE[[#This Row],[Eurozone]]<>\"\",ROUND(CRMPRODUCTINFOTABLE[[#This Row],[Eurozone]]*DKKEURORATE,4),\"\")","v":""},{"$f":"IF(CRMPRODUCTINFOTABLE[[#This Row],[Eurozone]]<>\"\",ROUND(CRMPRODUCTINFOTABLE[[#This Row],[Eurozone]]*NOKEURORATE,4),\"\")","v":""},{"$f":"IF(CRMPRODUCTINFOTABLE[[#This Row],[Eurozone]]<>\"\",ROUND(CRMPRODUCTINFOTABLE[[#This Row],[Eurozone]]*SEKEURORATE,4),\"\")","v":""},{"$f":"IF(CRMPRODUCTINFOTABLE[[#This Row],[Eurozone]]<>\"\",ROUND(CRMPRODUCTINFOTABLE[[#This Row],[Eurozone]]*CHFEURORATE,4),\"\")","v":""},{"$f":"IF(CRMPRODUCTINFOTABLE[[#This Row],[Eurozone]]<>\"\",ROUND(CRMPRODUCTINFOTABLE[[#This Row],[Eurozone]]*GBPEURORATE,4),\"\")","v":""}]
[15,109057049,"Language: Portuguese (Brazil)",0,1,null,null,null,null,null,null,null,null,null,null,null,null,null,null,null,null,null,null,null,null,null,null,null,null,null,null,{"$f":"IF(CRMPRODUCTINFOTABLE[[#This Row],[Eurozone]]<>\"\",ROUND(CRMPRODUCTINFOTABLE[[#This Row],[Eurozone]]*DKKEURORATE,4),\"\")","v":""},{"$f":"IF(CRMPRODUCTINFOTABLE[[#This Row],[Eurozone]]<>\"\",ROUND(CRMPRODUCTINFOTABLE[[#This Row],[Eurozone]]*NOKEURORATE,4),\"\")","v":""},{"$f":"IF(CRMPRODUCTINFOTABLE[[#This Row],[Eurozone]]<>\"\",ROUND(CRMPRODUCTINFOTABLE[[#This Row],[Eurozone]]*SEKEURORATE,4),\"\")","v":""},{"$f":"IF(CRMPRODUCTINFOTABLE[[#This Row],[Eurozone]]<>\"\",ROUND(CRMPRODUCTINFOTABLE[[#This Row],[Eurozone]]*CHFEURORATE,4),\"\")","v":""},{"$f":"IF(CRMPRODUCTINFOTABLE[[#This Row],[Eurozone]]<>\"\",ROUND(CRMPRODUCTINFOTABLE[[#This Row],[Eurozone]]*GBPEURORATE,4),\"\")","v":""}]
[16,109056982,"Language: Chinese Simplified",0,1,null,null,null,null,null,null,null,null,null,null,null,null,null,null,null,null,null,null,null,null,null,null,null,null,null,null,{"$f":"IF(CRMPRODUCTINFOTABLE[[#This Row],[Eurozone]]<>\"\",ROUND(CRMPRODUCTINFOTABLE[[#This Row],[Eurozone]]*DKKEURORATE,4),\"\")","v":""},{"$f":"IF(CRMPRODUCTINFOTABLE[[#This Row],[Eurozone]]<>\"\",ROUND(CRMPRODUCTINFOTABLE[[#This Row],[Eurozone]]*NOKEURORATE,4),\"\")","v":""},{"$f":"IF(CRMPRODUCTINFOTABLE[[#This Row],[Eurozone]]<>\"\",ROUND(CRMPRODUCTINFOTABLE[[#This Row],[Eurozone]]*SEKEURORATE,4),\"\")","v":""},{"$f":"IF(CRMPRODUCTINFOTABLE[[#This Row],[Eurozone]]<>\"\",ROUND(CRMPRODUCTINFOTABLE[[#This Row],[Eurozone]]*CHFEURORATE,4),\"\")","v":""},{"$f":"IF(CRMPRODUCTINFOTABLE[[#This Row],[Eurozone]]<>\"\",ROUND(CRMPRODUCTINFOTABLE[[#This Row],[Eurozone]]*GBPEURORATE,4),\"\")","v":""}]
[17,109056984,"Language: Chinese Traditional",0,1,null,null,null,null,null,null,null,null,null,null,null,null,null,null,null,null,null,null,null,null,null,null,null,null,null,null,{"$f":"IF(CRMPRODUCTINFOTABLE[[#This Row],[Eurozone]]<>\"\",ROUND(CRMPRODUCTINFOTABLE[[#This Row],[Eurozone]]*DKKEURORATE,4),\"\")","v":""},{"$f":"IF(CRMPRODUCTINFOTABLE[[#This Row],[Eurozone]]<>\"\",ROUND(CRMPRODUCTINFOTABLE[[#This Row],[Eurozone]]*NOKEURORATE,4),\"\")","v":""},{"$f":"IF(CRMPRODUCTINFOTABLE[[#This Row],[Eurozone]]<>\"\",ROUND(CRMPRODUCTINFOTABLE[[#This Row],[Eurozone]]*SEKEURORATE,4),\"\")","v":""},{"$f":"IF(CRMPRODUCTINFOTABLE[[#This Row],[Eurozone]]<>\"\",ROUND(CRMPRODUCTINFOTABLE[[#This Row],[Eurozone]]*CHFEURORATE,4),\"\")","v":""},{"$f":"IF(CRMPRODUCTINFOTABLE[[#This Row],[Eurozone]]<>\"\",ROUND(CRMPRODUCTINFOTABLE[[#This Row],[Eurozone]]*GBPEURORATE,4),\"\")","v":""}]
[18,109056983,"Language: Chinese (Hong Kong SAR)",0,1,null,null,null,null,null,null,null,null,null,null,null,null,null,null,null,null,null,null,null,null,null,null,null,null,null,null,{"$f":"IF(CRMPRODUCTINFOTABLE[[#This Row],[Eurozone]]<>\"\",ROUND(CRMPRODUCTINFOTABLE[[#This Row],[Eurozone]]*DKKEURORATE,4),\"\")","v":""},{"$f":"IF(CRMPRODUCTINFOTABLE[[#This Row],[Eurozone]]<>\"\",ROUND(CRMPRODUCTINFOTABLE[[#This Row],[Eurozone]]*NOKEURORATE,4),\"\")","v":""},{"$f":"IF(CRMPRODUCTINFOTABLE[[#This Row],[Eurozone]]<>\"\",ROUND(CRMPRODUCTINFOTABLE[[#This Row],[Eurozone]]*SEKEURORATE,4),\"\")","v":""},{"$f":"IF(CRMPRODUCTINFOTABLE[[#This Row],[Eurozone]]<>\"\",ROUND(CRMPRODUCTINFOTABLE[[#This Row],[Eurozone]]*CHFEURORATE,4),\"\")","v":""},{"$f":"IF(CRMPRODUCTINFOTABLE[[#This Row],[Eurozone]]<>\"\",ROUND(CRMPRODUCTINFOTABLE[[#This Row],[Eurozone]]*GBPEURORATE,4),\"\")","v":""}]
[19,109056985,"Language: Czech",0,1,null,null,null,null,null,null,null,null,null,null,null,null,null,null,null,null,null,null,null,null,null,null,null,null,null,null,{"$f":"IF(CRMPRODUCTINFOTABLE[[#This Row],[Eurozone]]<>\"\",ROUND(CRMPRODUCTINFOTABLE[[#This Row],[Eurozone]]*DKKEURORATE,4),\"\")","v":""},{"$f":"IF(CRMPRODUCTINFOTABLE[[#This Row],[Eurozone]]<>\"\",ROUND(CRMPRODUCTINFOTABLE[[#This Row],[Eurozone]]*NOKEURORATE,4),\"\")","v":""},{"$f":"IF(CRMPRODUCTINFOTABLE[[#This Row],[Eurozone]]<>\"\",ROUND(CRMPRODUCTINFOTABLE[[#This Row],[Eurozone]]*SEKEURORATE,4),\"\")","v":""},{"$f":"IF(CRMPRODUCTINFOTABLE[[#This Row],[Eurozone]]<>\"\",ROUND(CRMPRODUCTINFOTABLE[[#This Row],[Eurozone]]*CHFEURORATE,4),\"\")","v":""},{"$f":"IF(CRMPRODUCTINFOTABLE[[#This Row],[Eurozone]]<>\"\",ROUND(CRMPRODUCTINFOTABLE[[#This Row],[Eurozone]]*GBPEURORATE,4),\"\")","v":""}]
[20,109056986,"Language: Danish",0,1,null,null,null,null,null,null,null,null,null,null,null,null,null,null,null,null,null,null,null,null,null,null,null,null,null,null,{"$f":"IF(CRMPRODUCTINFOTABLE[[#This Row],[Eurozone]]<>\"\",ROUND(CRMPRODUCTINFOTABLE[[#This Row],[Eurozone]]*DKKEURORATE,4),\"\")","v":""},{"$f":"IF(CRMPRODUCTINFOTABLE[[#This Row],[Eurozone]]<>\"\",ROUND(CRMPRODUCTINFOTABLE[[#This Row],[Eurozone]]*NOKEURORATE,4),\"\")","v":""},{"$f":"IF(CRMPRODUCTINFOTABLE[[#This Row],[Eurozone]]<>\"\",ROUND(CRMPRODUCTINFOTABLE[[#This Row],[Eurozone]]*SEKEURORATE,4),\"\")","v":""},{"$f":"IF(CRMPRODUCTINFOTABLE[[#This Row],[Eurozone]]<>\"\",ROUND(CRMPRODUCTINFOTABLE[[#This Row],[Eurozone]]*CHFEURORATE,4),\"\")","v":""},{"$f":"IF(CRMPRODUCTINFOTABLE[[#This Row],[Eurozone]]<>\"\",ROUND(CRMPRODUCTINFOTABLE[[#This Row],[Eurozone]]*GBPEURORATE,4),\"\")","v":""}]
[21,109056948,"Language: Dutch",0,1,null,null,null,null,null,null,null,null,null,null,null,null,null,null,null,null,null,null,null,null,null,null,null,null,null,null,{"$f":"IF(CRMPRODUCTINFOTABLE[[#This Row],[Eurozone]]<>\"\",ROUND(CRMPRODUCTINFOTABLE[[#This Row],[Eurozone]]*DKKEURORATE,4),\"\")","v":""},{"$f":"IF(CRMPRODUCTINFOTABLE[[#This Row],[Eurozone]]<>\"\",ROUND(CRMPRODUCTINFOTABLE[[#This Row],[Eurozone]]*NOKEURORATE,4),\"\")","v":""},{"$f":"IF(CRMPRODUCTINFOTABLE[[#This Row],[Eurozone]]<>\"\",ROUND(CRMPRODUCTINFOTABLE[[#This Row],[Eurozone]]*SEKEURORATE,4),\"\")","v":""},{"$f":"IF(CRMPRODUCTINFOTABLE[[#This Row],[Eurozone]]<>\"\",ROUND(CRMPRODUCTINFOTABLE[[#This Row],[Eurozone]]*CHFEURORATE,4),\"\")","v":""},{"$f":"IF(CRMPRODUCTINFOTABLE[[#This Row],[Eurozone]]<>\"\",ROUND(CRMPRODUCTINFOTABLE[[#This Row],[Eurozone]]*GBPEURORATE,4),\"\")","v":""}]
[22,109056949,"Language: English",0,1,null,null,null,null,null,null,null,null,null,null,null,null,null,null,null,null,null,null,null,null,null,null,null,null,null,null,{"$f":"IF(CRMPRODUCTINFOTABLE[[#This Row],[Eurozone]]<>\"\",ROUND(CRMPRODUCTINFOTABLE[[#This Row],[Eurozone]]*DKKEURORATE,4),\"\")","v":""},{"$f":"IF(CRMPRODUCTINFOTABLE[[#This Row],[Eurozone]]<>\"\",ROUND(CRMPRODUCTINFOTABLE[[#This Row],[Eurozone]]*NOKEURORATE,4),\"\")","v":""},{"$f":"IF(CRMPRODUCTINFOTABLE[[#This Row],[Eurozone]]<>\"\",ROUND(CRMPRODUCTINFOTABLE[[#This Row],[Eurozone]]*SEKEURORATE,4),\"\")","v":""},{"$f":"IF(CRMPRODUCTINFOTABLE[[#This Row],[Eurozone]]<>\"\",ROUND(CRMPRODUCTINFOTABLE[[#This Row],[Eurozone]]*CHFEURORATE,4),\"\")","v":""},{"$f":"IF(CRMPRODUCTINFOTABLE[[#This Row],[Eurozone]]<>\"\",ROUND(CRMPRODUCTINFOTABLE[[#This Row],[Eurozone]]*GBPEURORATE,4),\"\")","v":""}]
[23,109056952,"Language: Finnish",0,1,null,null,null,null,null,null,null,null,null,null,null,null,null,null,null,null,null,null,null,null,null,null,null,null,null,null,{"$f":"IF(CRMPRODUCTINFOTABLE[[#This Row],[Eurozone]]<>\"\",ROUND(CRMPRODUCTINFOTABLE[[#This Row],[Eurozone]]*DKKEURORATE,4),\"\")","v":""},{"$f":"IF(CRMPRODUCTINFOTABLE[[#This Row],[Eurozone]]<>\"\",ROUND(CRMPRODUCTINFOTABLE[[#This Row],[Eurozone]]*NOKEURORATE,4),\"\")","v":""},{"$f":"IF(CRMPRODUCTINFOTABLE[[#This Row],[Eurozone]]<>\"\",ROUND(CRMPRODUCTINFOTABLE[[#This Row],[Eurozone]]*SEKEURORATE,4),\"\")","v":""},{"$f":"IF(CRMPRODUCTINFOTABLE[[#This Row],[Eurozone]]<>\"\",ROUND(CRMPRODUCTINFOTABLE[[#This Row],[Eurozone]]*CHFEURORATE,4),\"\")","v":""},{"$f":"IF(CRMPRODUCTINFOTABLE[[#This Row],[Eurozone]]<>\"\",ROUND(CRMPRODUCTINFOTABLE[[#This Row],[Eurozone]]*GBPEURORATE,4),\"\")","v":""}]
[24,109056953,"Language: French",0,1,null,null,null,null,null,null,null,null,null,null,null,null,null,null,null,null,null,null,null,null,null,null,null,null,null,null,{"$f":"IF(CRMPRODUCTINFOTABLE[[#This Row],[Eurozone]]<>\"\",ROUND(CRMPRODUCTINFOTABLE[[#This Row],[Eurozone]]*DKKEURORATE,4),\"\")","v":""},{"$f":"IF(CRMPRODUCTINFOTABLE[[#This Row],[Eurozone]]<>\"\",ROUND(CRMPRODUCTINFOTABLE[[#This Row],[Eurozone]]*NOKEURORATE,4),\"\")","v":""},{"$f":"IF(CRMPRODUCTINFOTABLE[[#This Row],[Eurozone]]<>\"\",ROUND(CRMPRODUCTINFOTABLE[[#This Row],[Eurozone]]*SEKEURORATE,4),\"\")","v":""},{"$f":"IF(CRMPRODUCTINFOTABLE[[#This Row],[Eurozone]]<>\"\",ROUND(CRMPRODUCTINFOTABLE[[#This Row],[Eurozone]]*CHFEURORATE,4),\"\")","v":""},{"$f":"IF(CRMPRODUCTINFOTABLE[[#This Row],[Eurozone]]<>\"\",ROUND(CRMPRODUCTINFOTABLE[[#This Row],[Eurozone]]*GBPEURORATE,4),\"\")","v":""}]
[25,109056960,"Language: German",0,1,null,null,null,null,null,null,null,null,null,null,null,null,null,null,null,null,null,null,null,null,null,null,null,null,null,null,{"$f":"IF(CRMPRODUCTINFOTABLE[[#This Row],[Eurozone]]<>\"\",ROUND(CRMPRODUCTINFOTABLE[[#This Row],[Eurozone]]*DKKEURORATE,4),\"\")","v":""},{"$f":"IF(CRMPRODUCTINFOTABLE[[#This Row],[Eurozone]]<>\"\",ROUND(CRMPRODUCTINFOTABLE[[#This Row],[Eurozone]]*NOKEURORATE,4),\"\")","v":""},{"$f":"IF(CRMPRODUCTINFOTABLE[[#This Row],[Eurozone]]<>\"\",ROUND(CRMPRODUCTINFOTABLE[[#This Row],[Eurozone]]*SEKEURORATE,4),\"\")","v":""},{"$f":"IF(CRMPRODUCTINFOTABLE[[#This Row],[Eurozone]]<>\"\",ROUND(CRMPRODUCTINFOTABLE[[#This Row],[Eurozone]]*CHFEURORATE,4),\"\")","v":""},{"$f":"IF(CRMPRODUCTINFOTABLE[[#This Row],[Eurozone]]<>\"\",ROUND(CRMPRODUCTINFOTABLE[[#This Row],[Eurozone]]*GBPEURORATE,4),\"\")","v":""}]
[26,109056961,"Language: Greek",0,1,null,null,null,null,null,null,null,null,null,null,null,null,null,null,null,null,null,null,null,null,null,null,null,null,null,null,{"$f":"IF(CRMPRODUCTINFOTABLE[[#This Row],[Eurozone]]<>\"\",ROUND(CRMPRODUCTINFOTABLE[[#This Row],[Eurozone]]*DKKEURORATE,4),\"\")","v":""},{"$f":"IF(CRMPRODUCTINFOTABLE[[#This Row],[Eurozone]]<>\"\",ROUND(CRMPRODUCTINFOTABLE[[#This Row],[Eurozone]]*NOKEURORATE,4),\"\")","v":""},{"$f":"IF(CRMPRODUCTINFOTABLE[[#This Row],[Eurozone]]<>\"\",ROUND(CRMPRODUCTINFOTABLE[[#This Row],[Eurozone]]*SEKEURORATE,4),\"\")","v":""},{"$f":"IF(CRMPRODUCTINFOTABLE[[#This Row],[Eurozone]]<>\"\",ROUND(CRMPRODUCTINFOTABLE[[#This Row],[Eurozone]]*CHFEURORATE,4),\"\")","v":""},{"$f":"IF(CRMPRODUCTINFOTABLE[[#This Row],[Eurozone]]<>\"\",ROUND(CRMPRODUCTINFOTABLE[[#This Row],[Eurozone]]*GBPEURORATE,4),\"\")","v":""}]
[27,109056962,"Language: Hebrew",0,1,null,null,null,null,null,null,null,null,null,null,null,null,null,null,null,null,null,null,null,null,null,null,null,null,null,null,{"$f":"IF(CRMPRODUCTINFOTABLE[[#This Row],[Eurozone]]<>\"\",ROUND(CRMPRODUCTINFOTABLE[[#This Row],[Eurozone]]*DKKEURORATE,4),\"\")","v":""},{"$f":"IF(CRMPRODUCTINFOTABLE[[#This Row],[Eurozone]]<>\"\",ROUND(CRMPRODUCTINFOTABLE[[#This Row],[Eurozone]]*NOKEURORATE,4),\"\")","v":""},{"$f":"IF(CRMPRODUCTINFOTABLE[[#This Row],[Eurozone]]<>\"\",ROUND(CRMPRODUCTINFOTABLE[[#This Row],[Eurozone]]*SEKEURORATE,4),\"\")","v":""},{"$f":"IF(CRMPRODUCTINFOTABLE[[#This Row],[Eurozone]]<>\"\",ROUND(CRMPRODUCTINFOTABLE[[#This Row],[Eurozone]]*CHFEURORATE,4),\"\")","v":""},{"$f":"IF(CRMPRODUCTINFOTABLE[[#This Row],[Eurozone]]<>\"\",ROUND(CRMPRODUCTINFOTABLE[[#This Row],[Eurozone]]*GBPEURORATE,4),\"\")","v":""}]
[28,109056963,"Language: Hungarian",0,1,null,null,null,null,null,null,null,null,null,null,null,null,null,null,null,null,null,null,null,null,null,null,null,null,null,null,{"$f":"IF(CRMPRODUCTINFOTABLE[[#This Row],[Eurozone]]<>\"\",ROUND(CRMPRODUCTINFOTABLE[[#This Row],[Eurozone]]*DKKEURORATE,4),\"\")","v":""},{"$f":"IF(CRMPRODUCTINFOTABLE[[#This Row],[Eurozone]]<>\"\",ROUND(CRMPRODUCTINFOTABLE[[#This Row],[Eurozone]]*NOKEURORATE,4),\"\")","v":""},{"$f":"IF(CRMPRODUCTINFOTABLE[[#This Row],[Eurozone]]<>\"\",ROUND(CRMPRODUCTINFOTABLE[[#This Row],[Eurozone]]*SEKEURORATE,4),\"\")","v":""},{"$f":"IF(CRMPRODUCTINFOTABLE[[#This Row],[Eurozone]]<>\"\",ROUND(CRMPRODUCTINFOTABLE[[#This Row],[Eurozone]]*CHFEURORATE,4),\"\")","v":""},{"$f":"IF(CRMPRODUCTINFOTABLE[[#This Row],[Eurozone]]<>\"\",ROUND(CRMPRODUCTINFOTABLE[[#This Row],[Eurozone]]*GBPEURORATE,4),\"\")","v":""}]
[29,109056964,"Language: Italian",0,1,null,null,null,null,null,null,null,null,null,null,null,null,null,null,null,null,null,null,null,null,null,null,null,null,null,null,{"$f":"IF(CRMPRODUCTINFOTABLE[[#This Row],[Eurozone]]<>\"\",ROUND(CRMPRODUCTINFOTABLE[[#This Row],[Eurozone]]*DKKEURORATE,4),\"\")","v":""},{"$f":"IF(CRMPRODUCTINFOTABLE[[#This Row],[Eurozone]]<>\"\",ROUND(CRMPRODUCTINFOTABLE[[#This Row],[Eurozone]]*NOKEURORATE,4),\"\")","v":""},{"$f":"IF(CRMPRODUCTINFOTABLE[[#This Row],[Eurozone]]<>\"\",ROUND(CRMPRODUCTINFOTABLE[[#This Row],[Eurozone]]*SEKEURORATE,4),\"\")","v":""},{"$f":"IF(CRMPRODUCTINFOTABLE[[#This Row],[Eurozone]]<>\"\",ROUND(CRMPRODUCTINFOTABLE[[#This Row],[Eurozone]]*CHFEURORATE,4),\"\")","v":""},{"$f":"IF(CRMPRODUCTINFOTABLE[[#This Row],[Eurozone]]<>\"\",ROUND(CRMPRODUCTINFOTABLE[[#This Row],[Eurozone]]*GBPEURORATE,4),\"\")","v":""}]
[30,109056965,"Language: Japanese",0,1,null,null,null,null,null,null,null,null,null,null,null,null,null,null,null,null,null,null,null,null,null,null,null,null,null,null,{"$f":"IF(CRMPRODUCTINFOTABLE[[#This Row],[Eurozone]]<>\"\",ROUND(CRMPRODUCTINFOTABLE[[#This Row],[Eurozone]]*DKKEURORATE,4),\"\")","v":""},{"$f":"IF(CRMPRODUCTINFOTABLE[[#This Row],[Eurozone]]<>\"\",ROUND(CRMPRODUCTINFOTABLE[[#This Row],[Eurozone]]*NOKEURORATE,4),\"\")","v":""},{"$f":"IF(CRMPRODUCTINFOTABLE[[#This Row],[Eurozone]]<>\"\",ROUND(CRMPRODUCTINFOTABLE[[#This Row],[Eurozone]]*SEKEURORATE,4),\"\")","v":""},{"$f":"IF(CRMPRODUCTINFOTABLE[[#This Row],[Eurozone]]<>\"\",ROUND(CRMPRODUCTINFOTABLE[[#This Row],[Eurozone]]*CHFEURORATE,4),\"\")","v":""},{"$f":"IF(CRMPRODUCTINFOTABLE[[#This Row],[Eurozone]]<>\"\",ROUND(CRMPRODUCTINFOTABLE[[#This Row],[Eurozone]]*GBPEURORATE,4),\"\")","v":""}]
[31,109056966,"Language: Korean",0,1,null,null,null,null,null,null,null,null,null,null,null,null,null,null,null,null,null,null,null,null,null,null,null,null,null,null,{"$f":"IF(CRMPRODUCTINFOTABLE[[#This Row],[Eurozone]]<>\"\",ROUND(CRMPRODUCTINFOTABLE[[#This Row],[Eurozone]]*DKKEURORATE,4),\"\")","v":""},{"$f":"IF(CRMPRODUCTINFOTABLE[[#This Row],[Eurozone]]<>\"\",ROUND(CRMPRODUCTINFOTABLE[[#This Row],[Eurozone]]*NOKEURORATE,4),\"\")","v":""},{"$f":"IF(CRMPRODUCTINFOTABLE[[#This Row],[Eurozone]]<>\"\",ROUND(CRMPRODUCTINFOTABLE[[#This Row],[Eurozone]]*SEKEURORATE,4),\"\")","v":""},{"$f":"IF(CRMPRODUCTINFOTABLE[[#This Row],[Eurozone]]<>\"\",ROUND(CRMPRODUCTINFOTABLE[[#This Row],[Eurozone]]*CHFEURORATE,4),\"\")","v":""},{"$f":"IF(CRMPRODUCTINFOTABLE[[#This Row],[Eurozone]]<>\"\",ROUND(CRMPRODUCTINFOTABLE[[#This Row],[Eurozone]]*GBPEURORATE,4),\"\")","v":""}]
[32,109056972,"Language: Norwegian (Bokmal)",0,1,null,null,null,null,null,null,null,null,null,null,null,null,null,null,null,null,null,null,null,null,null,null,null,null,null,null,{"$f":"IF(CRMPRODUCTINFOTABLE[[#This Row],[Eurozone]]<>\"\",ROUND(CRMPRODUCTINFOTABLE[[#This Row],[Eurozone]]*DKKEURORATE,4),\"\")","v":""},{"$f":"IF(CRMPRODUCTINFOTABLE[[#This Row],[Eurozone]]<>\"\",ROUND(CRMPRODUCTINFOTABLE[[#This Row],[Eurozone]]*NOKEURORATE,4),\"\")","v":""},{"$f":"IF(CRMPRODUCTINFOTABLE[[#This Row],[Eurozone]]<>\"\",ROUND(CRMPRODUCTINFOTABLE[[#This Row],[Eurozone]]*SEKEURORATE,4),\"\")","v":""},{"$f":"IF(CRMPRODUCTINFOTABLE[[#This Row],[Eurozone]]<>\"\",ROUND(CRMPRODUCTINFOTABLE[[#This Row],[Eurozone]]*CHFEURORATE,4),\"\")","v":""},{"$f":"IF(CRMPRODUCTINFOTABLE[[#This Row],[Eurozone]]<>\"\",ROUND(CRMPRODUCTINFOTABLE[[#This Row],[Eurozone]]*GBPEURORATE,4),\"\")","v":""}]
[33,109056973,"Language: Polish",0,1,null,null,null,null,null,null,null,null,null,null,null,null,null,null,null,null,null,null,null,null,null,null,null,null,null,null,{"$f":"IF(CRMPRODUCTINFOTABLE[[#This Row],[Eurozone]]<>\"\",ROUND(CRMPRODUCTINFOTABLE[[#This Row],[Eurozone]]*DKKEURORATE,4),\"\")","v":""},{"$f":"IF(CRMPRODUCTINFOTABLE[[#This Row],[Eurozone]]<>\"\",ROUND(CRMPRODUCTINFOTABLE[[#This Row],[Eurozone]]*NOKEURORATE,4),\"\")","v":""},{"$f":"IF(CRMPRODUCTINFOTABLE[[#This Row],[Eurozone]]<>\"\",ROUND(CRMPRODUCTINFOTABLE[[#This Row],[Eurozone]]*SEKEURORATE,4),\"\")","v":""},{"$f":"IF(CRMPRODUCTINFOTABLE[[#This Row],[Eurozone]]<>\"\",ROUND(CRMPRODUCTINFOTABLE[[#This Row],[Eurozone]]*CHFEURORATE,4),\"\")","v":""},{"$f":"IF(CRMPRODUCTINFOTABLE[[#This Row],[Eurozone]]<>\"\",ROUND(CRMPRODUCTINFOTABLE[[#This Row],[Eurozone]]*GBPEURORATE,4),\"\")","v":""}]
[34,109056974,"Language: Portuguese (Portugal)",0,1,null,null,null,null,null,null,null,null,null,null,null,null,null,null,null,null,null,null,null,null,null,null,null,null,null,null,{"$f":"IF(CRMPRODUCTINFOTABLE[[#This Row],[Eurozone]]<>\"\",ROUND(CRMPRODUCTINFOTABLE[[#This Row],[Eurozone]]*DKKEURORATE,4),\"\")","v":""},{"$f":"IF(CRMPRODUCTINFOTABLE[[#This Row],[Eurozone]]<>\"\",ROUND(CRMPRODUCTINFOTABLE[[#This Row],[Eurozone]]*NOKEURORATE,4),\"\")","v":""},{"$f":"IF(CRMPRODUCTINFOTABLE[[#This Row],[Eurozone]]<>\"\",ROUND(CRMPRODUCTINFOTABLE[[#This Row],[Eurozone]]*SEKEURORATE,4),\"\")","v":""},{"$f":"IF(CRMPRODUCTINFOTABLE[[#This Row],[Eurozone]]<>\"\",ROUND(CRMPRODUCTINFOTABLE[[#This Row],[Eurozone]]*CHFEURORATE,4),\"\")","v":""},{"$f":"IF(CRMPRODUCTINFOTABLE[[#This Row],[Eurozone]]<>\"\",ROUND(CRMPRODUCTINFOTABLE[[#This Row],[Eurozone]]*GBPEURORATE,4),\"\")","v":""}]
[35,109056975,"Language: Russian",0,1,null,null,null,null,null,null,null,null,null,null,null,null,null,null,null,null,null,null,null,null,null,null,null,null,null,null,{"$f":"IF(CRMPRODUCTINFOTABLE[[#This Row],[Eurozone]]<>\"\",ROUND(CRMPRODUCTINFOTABLE[[#This Row],[Eurozone]]*DKKEURORATE,4),\"\")","v":""},{"$f":"IF(CRMPRODUCTINFOTABLE[[#This Row],[Eurozone]]<>\"\",ROUND(CRMPRODUCTINFOTABLE[[#This Row],[Eurozone]]*NOKEURORATE,4),\"\")","v":""},{"$f":"IF(CRMPRODUCTINFOTABLE[[#This Row],[Eurozone]]<>\"\",ROUND(CRMPRODUCTINFOTABLE[[#This Row],[Eurozone]]*SEKEURORATE,4),\"\")","v":""},{"$f":"IF(CRMPRODUCTINFOTABLE[[#This Row],[Eurozone]]<>\"\",ROUND(CRMPRODUCTINFOTABLE[[#This Row],[Eurozone]]*CHFEURORATE,4),\"\")","v":""},{"$f":"IF(CRMPRODUCTINFOTABLE[[#This Row],[Eurozone]]<>\"\",ROUND(CRMPRODUCTINFOTABLE[[#This Row],[Eurozone]]*GBPEURORATE,4),\"\")","v":""}]
[36,109056976,"Language: Spanish",0,1,null,null,null,null,null,null,null,null,null,null,null,null,null,null,null,null,null,null,null,null,null,null,null,null,null,null,{"$f":"IF(CRMPRODUCTINFOTABLE[[#This Row],[Eurozone]]<>\"\",ROUND(CRMPRODUCTINFOTABLE[[#This Row],[Eurozone]]*DKKEURORATE,4),\"\")","v":""},{"$f":"IF(CRMPRODUCTINFOTABLE[[#This Row],[Eurozone]]<>\"\",ROUND(CRMPRODUCTINFOTABLE[[#This Row],[Eurozone]]*NOKEURORATE,4),\"\")","v":""},{"$f":"IF(CRMPRODUCTINFOTABLE[[#This Row],[Eurozone]]<>\"\",ROUND(CRMPRODUCTINFOTABLE[[#This Row],[Eurozone]]*SEKEURORATE,4),\"\")","v":""},{"$f":"IF(CRMPRODUCTINFOTABLE[[#This Row],[Eurozone]]<>\"\",ROUND(CRMPRODUCTINFOTABLE[[#This Row],[Eurozone]]*CHFEURORATE,4),\"\")","v":""},{"$f":"IF(CRMPRODUCTINFOTABLE[[#This Row],[Eurozone]]<>\"\",ROUND(CRMPRODUCTINFOTABLE[[#This Row],[Eurozone]]*GBPEURORATE,4),\"\")","v":""}]
[37,109056977,"Language: Swedish",0,1,null,null,null,null,null,null,null,null,null,null,null,null,null,null,null,null,null,null,null,null,null,null,null,null,null,null,{"$f":"IF(CRMPRODUCTINFOTABLE[[#This Row],[Eurozone]]<>\"\",ROUND(CRMPRODUCTINFOTABLE[[#This Row],[Eurozone]]*DKKEURORATE,4),\"\")","v":""},{"$f":"IF(CRMPRODUCTINFOTABLE[[#This Row],[Eurozone]]<>\"\",ROUND(CRMPRODUCTINFOTABLE[[#This Row],[Eurozone]]*NOKEURORATE,4),\"\")","v":""},{"$f":"IF(CRMPRODUCTINFOTABLE[[#This Row],[Eurozone]]<>\"\",ROUND(CRMPRODUCTINFOTABLE[[#This Row],[Eurozone]]*SEKEURORATE,4),\"\")","v":""},{"$f":"IF(CRMPRODUCTINFOTABLE[[#This Row],[Eurozone]]<>\"\",ROUND(CRMPRODUCTINFOTABLE[[#This Row],[Eurozone]]*CHFEURORATE,4),\"\")","v":""},{"$f":"IF(CRMPRODUCTINFOTABLE[[#This Row],[Eurozone]]<>\"\",ROUND(CRMPRODUCTINFOTABLE[[#This Row],[Eurozone]]*GBPEURORATE,4),\"\")","v":""}]
[38,109056978,"Language: Turkish",0,1,null,null,null,null,null,null,null,null,null,null,null,null,null,null,null,null,null,null,null,null,null,null,null,null,null,null,{"$f":"IF(CRMPRODUCTINFOTABLE[[#This Row],[Eurozone]]<>\"\",ROUND(CRMPRODUCTINFOTABLE[[#This Row],[Eurozone]]*DKKEURORATE,4),\"\")","v":""},{"$f":"IF(CRMPRODUCTINFOTABLE[[#This Row],[Eurozone]]<>\"\",ROUND(CRMPRODUCTINFOTABLE[[#This Row],[Eurozone]]*NOKEURORATE,4),\"\")","v":""},{"$f":"IF(CRMPRODUCTINFOTABLE[[#This Row],[Eurozone]]<>\"\",ROUND(CRMPRODUCTINFOTABLE[[#This Row],[Eurozone]]*SEKEURORATE,4),\"\")","v":""},{"$f":"IF(CRMPRODUCTINFOTABLE[[#This Row],[Eurozone]]<>\"\",ROUND(CRMPRODUCTINFOTABLE[[#This Row],[Eurozone]]*CHFEURORATE,4),\"\")","v":""},{"$f":"IF(CRMPRODUCTINFOTABLE[[#This Row],[Eurozone]]<>\"\",ROUND(CRMPRODUCTINFOTABLE[[#This Row],[Eurozone]]*GBPEURORATE,4),\"\")","v":""}]
[39,null,"Business Ready Enhancement Plan","OVERRIDE",1,0.16,0.16,0.16,0.16,0.16,0.16,0.16,0.16,0.16,0.16,0.16,0.16,0.16,0.16,0.16,0.16,0.16,0.16,0.16,0.16,0.16,0.16,0.16,0.16,0.16,0.16,0.16,0.16,0.16,0.16,0.16]
[40,null,"Three Year Business Ready Enhancement Plan","OVERRIDE",1,0.14000000000000001,0.14000000000000001,0.14000000000000001,0.16,0.14000000000000001,0.14000000000000001,0.14000000000000001,0.14000000000000001,0.14000000000000001,0.14000000000000001,0.14000000000000001,0.14000000000000001,0.14000000000000001,0.14000000000000001,0.14000000000000001,0.14000000000000001,0.14000000000000001,0.14000000000000001,0.14000000000000001,0.14000000000000001,0.14000000000000001,0.14000000000000001,0.14000000000000001,0.14000000000000001,0.16,0.14000000000000001,0.14000000000000001,0.14000000000000001,0.14000000000000001,0.14000000000000001,0.14000000000000001]
[41,null,"Business Ready Advantage Plan","OVERRIDE",1,null,0.18,null,0.18,null,null,0.18,null,0.18,null,null,null,null,0.18,0.18,0.18,null,null,0.18,null,null,null,null,null,0.18]
[42,null,"Business Ready Advantage Plus Plan","OVERRIDE",1,null,0.25,null,0.25,null,null,null,null,null,null,null,null,null,0.25,null,null,null,null,null,null,null,null,null,null,0.25]
[43,null,"Three Year Business Ready Advantage Plan","OVERRIDE",1,null,null,null,0.18,null,null,null,null,null,null,null,null,null,0.18,null,null,null,null,null,null,null,null,null,null,0.18]

{"sheet":"CRM Availability","index":15,"n_rows":46,"n_cols":275,"rows_kept":46,"cut":false,"hidden":true,"merged":[]}
[]
[null,null,"ALL CHECK",{"$f":"SUM(Table70[ALL - Africa])","v":0},{"$f":"SUM(Table70[Algeria])","v":39},{"$f":"SUM(Table70[Angola])","v":39},{"$f":"SUM(Table70[Benin])","v":39},{"$f":"SUM(Table70[Botswana])","v":39},{"$f":"SUM(Table70[Burkina Faso])","v":39},{"$f":"SUM(Table70[Burundi])","v":39},{"$f":"SUM(Table70[Cameroon])","v":39},{"$f":"SUM(Table70[Cape Verde])","v":39},{"$f":"SUM(Table70[Central African Republic])","v":39},{"$f":"SUM(Table70[Chad])","v":39},{"$f":"SUM(Table70[Comoros])","v":39},{"$f":"SUM(Table70[Congo])","v":39},{"$f":"SUM(Table70[Congo (DRC)])","v":39},{"$f":"SUM(Table70[Côte d''Ivoire])","v":39},{"$f":"SUM(Table70[Djibouti])","v":39},{"$f":"SUM(Table70[Egypt])","v":39},{"$f":"SUM(Table70[Equatorial Guinea])","v":39},{"$f":"SUM(Table70[Eritrea])","v":39},{"$f":"SUM(Table70[Ethiopia])","v":39},{"$f":"SUM(Table70[French Polynesia])","v":39},{"$f":"SUM(Table70[Gabon])","v":39},{"$f":"SUM(Table70[Gambia, The])","v":39},{"$f":"SUM(Table70[Ghana])","v":39},{"$f":"SUM(Table70[Guinea])","v":39},{"$f":"SUM(Table70[Guinea-Bissau])","v":39},{"$f":"SUM(Table70[Kenya])","v":39},{"$f":"SUM(Table70[Lesotho])","v":39},{"$f":"SUM(Table70[Liberia])","v":39},{"$f":"SUM(Table70[Libya])","v":39},{"$f":"SUM(Table70[Madagascar])","v":39},{"$f":"SUM(Table70[Malawi])","v":39},{"$f":"SUM(Table70[Mali])","v":39},{"$f":"SUM(Table70[Mauritania])","v":39},{"$f":"SUM(Table70[Mauritius])","v":39},{"$f":"SUM(Table70[Morocco])","v":39},{"$f":"SUM(Table70[Mozambique])","v":39},{"$f":"SUM(Table70[Namibia])","v":39},{"$f":"SUM(Table70[New Caledonia])","v":39},{"$f":"SUM(Table70[Niger])","v":39},{"$f":"SUM(Table70[Nigeria])","v":39},{"$f":"SUM(Table70[Rwanda])","v":39},{"$f":"SUM(Table70[Sao Tomé and Príncipe])","v":39},{"$f":"SUM(Table70[Senegal])","v":39},{"$f":"SUM(Table70[Seychelles])","v":39},{"$f":"SUM(Table70[Sierra Leone])","v":39},{"$f":"SUM(Table70[Somalia])","v":39},{"$f":"SUM(Table70[Sudan])","v":39},{"$f":"SUM(Table70[Swaziland])","v":39},{"$f":"SUM(Table70[Tanzania])","v":39},{"$f":"SUM(Table70[Togo])","v":39},{"$f":"SUM(Table70[Tunisia])","v":39},{"$f":"SUM(Table70[Uganda])","v":39},{"$f":"SUM(Table70[Western Sahara])","v":39},{"$f":"SUM(Table70[Zambia])","v":39},{"$f":"SUM(Table70[Zimbabwe])","v":39},{"$f":"SUM(Table70[ALL - APOC United States ])","v":0},{"$f":"SUM(Table70[American Samoa])","v":41},{"$f":"SUM(Table70[Guam])","v":41},{"$f":"SUM(Table70[Marshall Islands])","v":41},{"$f":"SUM(Table70[Northern Mariana Islands])","v":41},{"$f":"SUM(Table70[ALL - Australia])","v":0},{"$f":"SUM(Table70[Australia])","v":39},{"$f":"SUM(Table70[Christmas Island])","v":39},{"$f":"SUM(Table70[Cocos (Keeling) Islands])","v":39},{"$f":"SUM(Table70[Heard Island and McDonald Islands])","v":39},{"$f":"SUM(Table70[Kiribati])","v":39},{"$f":"SUM(Table70[Nauru])","v":39},{"$f":"SUM(Table70[Norfolk Island])","v":39},{"$f":"SUM(Table70[Tuvalu])","v":39},{"$f":"SUM(Table70[ALL - Canada])","v":0},{"$f":"SUM(Table70[Canada])","v":42},{"$f":"SUM(Table70[Saint Pierre and Miquelon])","v":42},{"$f":"SUM(Table70[ALL - Central Asia 1 - CEE 1 ])","v":0},{"$f":"SUM(Table70[Afghanistan])","v":39},{"$f":"SUM(Table70[Kyrgyzstan])","v":39},{"$f":"SUM(Table70[Mongolia])","v":39},{"$f":"SUM(Table70[Pakistan])","v":39},{"$f":"SUM(Table70[ALL - Central Asia 2 - CEE 2])","v":0},{"$f":"SUM(Table70[Azerbaijan])","v":39},{"$f":"SUM(Table70[Kazakhstan])","v":39},{"$f":"SUM(Table70[Tajikistan])","v":39},{"$f":"SUM(Table70[Turkmenistan])","v":39},{"$f":"SUM(Table70[Uzbekistan])","v":39},{"$f":"SUM(Table70[ALL - Chile])","v":0},{"$f":"SUM(Table70[Chile])","v":40},{"$f":"SUM(Table70[ALL - China])","v":0},{"$f":"SUM(Table70[China])","v":39},{"$f":"SUM(Table70[ALL - Colombia])","v":0},{"$f":"SUM(Table70[Colombia])","v":40},{"$f":"SUM(Table70[ALL - Denmark2])","v":0},{"$f":"SUM(Table70[Denmark])","v":39},{"$f":"SUM(Table70[Faroe Islands])","v":39},{"$f":"SUM(Table70[Greenland])","v":39},{"$f":"SUM(Table70[ALL - Eastern Euope 1])","v":0},{"$f":"SUM(Table70[Albania])","v":39},{"$f":"SUM(Table70[Bosnia and Herzegovina])","v":39},{"$f":"SUM(Table70[Macedonia])","v":39},{"$f":"SUM(Table70[Montenegro])","v":39},{"$f":"SUM(Table70[ALL - Eastern Europe 2])","v":0},{"$f":"SUM(Table70[Armenia])","v":39},{"$f":"SUM(Table70[Belarus])","v":39},{"$f":"SUM(Table70[Georgia])","v":39},{"$f":"SUM(Table70[Moldova])","v":39},{"$f":"SUM(Table70[Ukraine])","v":39},{"$f":"SUM(Table70[ALL - Eurozone])","v":0},{"$f":"SUM(Table70[Andorra])","v":39},{"$f":"SUM(Table70[Austria])","v":39},{"$f":"SUM(Table70[Belgium])","v":39},{"$f":"SUM(Table70[Bulgaria])","v":39},{"$f":"SUM(Table70[Croatia])","v":39},{"$f":"SUM(Table70[Cyprus])","v":39},{"$f":"SUM(Table70[Czech Republic])","v":39},{"$f":"SUM(Table70[Estonia])","v":39},{"$f":"SUM(Table70[Finland])","v":39},{"$f":"SUM(Table70[France])","v":39},{"$f":"SUM(Table70[French Southern and Antarctic Lands])","v":39},{"$f":"SUM(Table70[French Guiana])","v":39},{"$f":"SUM(Table70[Germany])","v":39},{"$f":"SUM(Table70[Greece])","v":39},{"$f":"SUM(Table70[Guadeloupe])","v":39},{"$f":"SUM(Table70[Hungary])","v":39},{"$f":"SUM(Table70[Iceland])","v":39},{"$f":"SUM(Table70[Italy])","v":39},{"$f":"SUM(Table70[Ireland, Republic of])","v":39},{"$f":"SUM(Table70[Latvia])","v":39},{"$f":"SUM(Table70[Lithuania])","v":39},{"$f":"SUM(Table70[Luxembourg])","v":39},{"$f":"SUM(Table70[Malta])","v":39},{"$f":"SUM(Table70[Martinique])","v":39},{"$f":"SUM(Table70[Mayotte])","v":39},{"$f":"SUM(Table70[Monaco])","v":39},{"$f":"SUM(Table70[Netherlands, The])","v":39},{"$f":"SUM(Table70[Poland])","v":39},{"$f":"SUM(Table70[Portugal])","v":39},{"$f":"SUM(Table70[Reunion])","v":39},{"$f":"SUM(Table70[Romania])","v":39},{"$f":"SUM(Table70[San Marino])","v":39},{"$f":"SUM(Table70[Slovakia])","v":39},{"$f":"SUM(Table70[Slovenia])","v":39},{"$f":"SUM(Table70[Spain])","v":39},{"$f":"SUM(Table70[Vatican City])","v":39},{"$f":"SUM(Table70[ALL  - India])","v":0},{"$f":"SUM(Table70[India])","v":39},{"$f":"SUM(Table70[ALL - Japan])","v":0},{"$f":"SUM(Table70[Japan])","v":39},{"$f":"SUM(Table70[ALL - Latam Caribbean])","v":0},{"$f":"SUM(Table70[Anguilla])","v":42},{"$f":"SUM(Table70[Antarctica])","v":42},{"$f":"SUM(Table70[Antigua and Barbuda])","v":42},{"$f":"SUM(Table70[Aruba])","v":42},{"$f":"SUM(Table70[Bahamas, The])","v":42},{"$f":"SUM(Table70[Barbados])","v":42},{"$f":"SUM(Table70[Cuba])","v":42},{"$f":"SUM(Table70[Dominica])","v":42},{"$f":"SUM(Table70[Grenada])","v":42},{"$f":"SUM(Table70[Guyana])","v":42},{"$f":"SUM(Table70[Haiti])","v":42},{"$f":"SUM(Table70[Jamaica])","v":42},{"$f":"SUM(Table70[Montserrat])","v":42},{"$f":"SUM(Table70[Netherlands Antilles])","v":42},{"$f":"SUM(Table70[Saint Kitts and Nevis])","v":42},{"$f":"SUM(Table70[Saint Lucia])","v":42},{"$f":"SUM(Table70[Saint Vincent and the Grenadines])","v":42},{"$f":"SUM(Table70[Suriname])","v":42},{"$f":"SUM(Table70[Trinidad and Tobago])","v":42},{"$f":"SUM(Table70[Turks and Caicos Islands])","v":42},{"$f":"SUM(Table70[Virgin Islands, British])","v":42},{"$f":"SUM(Table70[ALL - Latam PR/BM/CI/VI])","v":0},{"$f":"SUM(Table70[Bermuda])","v":40},{"$f":"SUM(Table70[Cayman Islands])","v":40},{"$f":"SUM(Table70[Puerto Rico])","v":40},{"$f":"SUM(Table70[Virgin Islands, U.S.])","v":40},{"$f":"SUM(Table70[ALL - Mexico])","v":0},{"$f":"SUM(Table70[Mexico])","v":40},{"$f":"SUM(Table70[ALL - Middle East])","v":0},{"$f":"SUM(Table70[Bahrain])","v":39},{"$f":"SUM(Table70[Palestinian Authority])","v":39},{"$f":"SUM(Table70[Iran])","v":39},{"$f":"SUM(Table70[Iraq])","v":39},{"$f":"SUM(Table70[Israel])","v":39},{"$f":"SUM(Table70[Jordan])","v":39},{"$f":"SUM(Table70[Kuwait])","v":39},{"$f":"SUM(Table70[Lebanon])","v":39},{"$f":"SUM(Table70[Oman])","v":39},{"$f":"SUM(Table70[Qatar])","v":39},{"$f":"SUM(Table70[Saudi Arabia])","v":39},{"$f":"SUM(Table70[Syria])","v":39},{"$f":"SUM(Table70[United Arab Emirates])","v":39},{"$f":"SUM(Table70[Yemen])","v":39},{"$f":"SUM(Table70[ALL - New Zealand])","v":0},{"$f":"SUM(Table70[Cook Islands])","v":39},{"$f":"SUM(Table70[New Zealand])","v":39},{"$f":"SUM(Table70[Niue])","v":39},{"$f":"SUM(Table70[Tokelau])","v":39},{"$f":"SUM(Table70[ALL - Norway2])","v":0},{"$f":"SUM(Table70[Bouvet Island])","v":39},{"$f":"SUM(Table70[Norway])","v":39},{"$f":"SUM(Table70[Svalbard and Jan Mayen])","v":39},{"$f":"SUM(Table70[ALL - Rest of Latam])","v":0},{"$f":"SUM(Table70[Argentina])","v":40},{"$f":"SUM(Table70[Belize])","v":40},{"$f":"SUM(Table70[Bolivia])","v":40},{"$f":"SUM(Table70[Brazil])","v":40},{"$f":"SUM(Table70[Costa Rica])","v":40},{"$f":"SUM(Table70[Dominican Republic])","v":40},{"$f":"SUM(Table70[Ecuador])","v":40},{"$f":"SUM(Table70[El Salvador])","v":40},{"$f":"SUM(Table70[Falkland Islands (Islas Malvinas)])","v":40},{"$f":"SUM(Table70[Guatemala])","v":40},{"$f":"SUM(Table70[Honduras])","v":40},{"$f":"SUM(Table70[Nicaragua])","v":40},{"$f":"SUM(Table70[Panama])","v":40},{"$f":"SUM(Table70[Paraguay])","v":40},{"$f":"SUM(Table70[Peru])","v":40},{"$f":"SUM(Table70[South Georgia and the South Sandwich Islands])","v":40},{"$f":"SUM(Table70[Uruguay])","v":40},{"$f":"SUM(Table70[Venezuela])","v":40},{"$f":"SUM(Table70[ALL - Russia])","v":0},{"$f":"SUM(Table70[Russia])","v":39},{"$f":"SUM(Table70[ALL - Serbia])","v":0},{"$f":"SUM(Table70[Serbia])","v":39},{"$f":"SUM(Table70[ALL - South Africa])","v":0},{"$f":"SUM(Table70[South Africa])","v":39},{"$f":"SUM(Table70[ALL - South East Asia])","v":0},{"$f":"SUM(Table70[Bangladesh])","v":39},{"$f":"SUM(Table70[Bhutan])","v":39},{"$f":"SUM(Table70[British Indian Ocean Territory])","v":39},{"$f":"SUM(Table70[Brunei])","v":39},{"$f":"SUM(Table70[Cambodia])","v":39},{"$f":"SUM(Table70[Fiji Islands])","v":39},{"$f":"SUM(Table70[Hong Kong SAR])","v":39},{"$f":"SUM(Table70[Indonesia])","v":39},{"$f":"SUM(Table70[Korea, North])","v":39},{"$f":"SUM(Table70[Korea, South])","v":39},{"$f":"SUM(Table70[Laos])","v":39},{"$f":"SUM(Table70[Macao SAR])","v":39},{"$f":"SUM(Table70[Malaysia])","v":39},{"$f":"SUM(Table70[Maldives])","v":39},{"$f":"SUM(Table70[Micronesia])","v":39},{"$f":"SUM(Table70[Myanmar])","v":39},{"$f":"SUM(Table70[Nepal])","v":39},{"$f":"SUM(Table70[Palau])","v":39},{"$f":"SUM(Table70[Papua New Guinea])","v":39},{"$f":"SUM(Table70[Philippines])","v":39},{"$f":"SUM(Table70[Pitcairn Islands])","v":39},{"$f":"SUM(Table70[Samoa])","v":39},{"$f":"SUM(Table70[Singapore])","v":39},{"$f":"SUM(Table70[Solomon Islands])","v":39},{"$f":"SUM(Table70[Sri Lanka])","v":39},{"$f":"SUM(Table70[Taiwan])","v":39},{"$f":"SUM(Table70[Thailand])","v":39},{"$f":"SUM(Table70[Timor-Leste])","v":39},{"$f":"SUM(Table70[Tonga])","v":39},{"$f":"SUM(Table70[Vanuatu])","v":39},{"$f":"SUM(Table70[Vietnam])","v":39},{"$f":"SUM(Table70[Wallis and Futuna])","v":39},{"$f":"SUM(Table70[ALL - Sweden2])","v":0},{"$f":"SUM(Table70[Sweden])","v":39},{"$f":"SUM(Table70[ALL - Switzerland2])","v":0},{"$f":"SUM(Table70[Liechtenstein])","v":39},{"$f":"SUM(Table70[Switzerland])","v":39},{"$f":"SUM(Table70[ALL - Turkey])","v":0},{"$f":"SUM(Table70[Turkey])","v":39},{"$f":"SUM(Table70[ALL - United Kingdom2])","v":0},{"$f":"SUM(Table70[Gibraltar])","v":39},{"$f":"SUM(Table70[Saint Helena])","v":39},{"$f":"SUM(Table70[United Kingdom])","v":39},{"$f":"SUM(Table70[ALL - United States])","v":0},{"$f":"COUNTA(JM4:JM43)","v":40},{"$f":"COUNTA(JN4:JN43)","v":40}]
[null,null,"VERSION Availablity"]
[null,"SKU","Item Description","ALL - Africa","Algeria","Angola","Benin","Botswana","Burkina Faso","Burundi","Cameroon","Cape Verde","Central African Republic","Chad","Comoros","Congo","Congo (DRC)","Côte d'Ivoire","Djibouti","Egypt","Equatorial Guinea","Eritrea","Ethiopia","French Polynesia","Gabon","Gambia, The","Ghana","Guinea","Guinea-Bissau","Kenya","Lesotho","Liberia","Libya","Madagascar","Malawi","Mali","Mauritania","Mauritius","Morocco","Mozambique","Namibia","New Caledonia","Niger","Nigeria","Rwanda","Sao Tomé and Príncipe","Senegal","Seychelles","Sierra Leone","Somalia","Sudan","Swaziland","Tanzania","Togo","Tunisia","Uganda","Western Sahara","Zambia","Zimbabwe","ALL - APOC United States ","American Samoa","Guam","Marshall Islands","Northern Mariana Islands","ALL - Australia","Australia","Christmas Island","Cocos (Keeling) Islands","Heard Island and McDonald Islands","Kiribati","Nauru","Norfolk Island","Tuvalu","ALL - Canada","Canada","Saint Pierre and Miquelon","ALL - Central Asia 1 - CEE 1 ","Afghanistan","Kyrgyzstan","Mongolia","Pakistan","ALL - Central Asia 2 - CEE 2","Azerbaijan","Kazakhstan","Tajikistan","Turkmenistan","Uzbekistan","ALL - Chile","Chile","ALL - China","China","ALL - Colombia","Colombia","ALL - Denmark2","Denmark","Faroe Islands","Greenland","ALL - Eastern Euope 1","Albania","Bosnia and Herzegovina","Macedonia","Montenegro","ALL - Eastern Europe 2","Armenia","Belarus","Georgia","Moldova","Ukraine","ALL - Eurozone","Andorra","Austria","Belgium","Bulgaria","Croatia","Cyprus","Czech Republic","Estonia","Finland","France","French Southern and Antarctic Lands","French Guiana","Germany","Greece","Guadeloupe","Hungary","Iceland","Italy","Ireland, Republic of","Latvia","Lithuania","Luxembourg","Malta","Martinique","Mayotte","Monaco","Netherlands, The","Poland","Portugal","Reunion","Romania","San Marino","Slovakia","Slovenia","Spain","Vatican City","ALL  - India","India","ALL - Japan","Japan","ALL - Latam Caribbean","Anguilla","Antarctica","Antigua and Barbuda","Aruba","Bahamas, The","Barbados","Cuba","Dominica","Grenada","Guyana","Haiti","Jamaica","Montserrat","Netherlands Antilles","Saint Kitts and Nevis","Saint Lucia","Saint Vincent and the Grenadines","Suriname","Trinidad and Tobago","Turks and Caicos Islands","Virgin Islands, British","ALL - Latam PR/BM/CI/VI","Bermuda","Cayman Islands","Puerto Rico","Virgin Islands, U.S.","ALL - Mexico","Mexico","ALL - Middle East","Bahrain","Palestinian Authority","Iran","Iraq","Israel","Jordan","Kuwait","Lebanon","Oman","Qatar","Saudi Arabia","Syria","United Arab Emirates","Yemen","ALL - New Zealand","Cook Islands","New Zealand","Niue","Tokelau","ALL - Norway2","Bouvet Island","Norway","Svalbard and Jan Mayen","ALL - Rest of Latam","Argentina","Belize","Bolivia","Brazil","Costa Rica","Dominican Republic","Ecuador","El Salvador","Falkland Islands (Islas Malvinas)","Guatemala","Honduras","Nicaragua","Panama","Paraguay","Peru","South Georgia and the South Sandwich Islands","Uruguay","Venezuela","ALL - Russia","Russia","ALL - Serbia","Serbia","ALL - South Africa","South Africa","ALL - South East Asia","Bangladesh","Bhutan","British Indian Ocean Territory","Brunei","Cambodia","Fiji Islands","Hong Kong SAR","Indonesia","Korea, North","Korea, South","Laos","Macao SAR","Malaysia","Maldives","Micronesia","Myanmar","Nepal","Palau","Papua New Guinea","Philippines","Pitcairn Islands","Samoa","Singapore","Solomon Islands","Sri Lanka","Taiwan","Thailand","Timor-Leste","Tonga","Vanuatu","Vietnam","Wallis and Futuna","ALL - Sweden2","Sweden","ALL - Switzerland2","Liechtenstein","Switzerland","ALL - Turkey","Turkey","ALL - United Kingdom2","Gibraltar","Saint Helena","United Kingdom","ALL - United States","United States","U.S. Minor Outlying Islands","No of countries"]
[null,109057076,"Microsoft Dynamics CRM 2011 Server    ","ALL",1,1,1,1,1,1,1,1,1,1,1,1,1,1,1,1,1,1,1,1,1,1,1,1,1,1,1,1,1,1,1,1,1,1,1,1,1,1,1,1,1,1,1,1,1,1,1,1,1,1,1,1,1,1,1,"ALL",1,1,1,1,"ALL",1,1,1,1,1,1,1,1,"ALL",1,1,"ALL",1,1,1,1,"ALL",1,1,1,1,1,"ALL",1,"ALL",1,"ALL",1,"ALL",1,1,1,"ALL",1,1,1,1,"ALL",1,1,1,1,1,"ALL",1,1,1,1,1,1,1,1,1,1,1,1,1,1,1,1,1,1,1,1,1,1,1,1,1,1,1,1,1,1,1,1,1,1,1,1,"ALL",1,"ALL",1,"ALL",1,1,1,1,1,1,1,1,1,1,1,1,1,1,1,1,1,1,1,1,1,"ALL",1,1,1,1,"ALL",1,"ALL",1,1,1,1,1,1,1,1,1,1,1,1,1,1,"ALL",1,1,1,1,"ALL",1,1,1,"ALL",1,1,1,1,1,1,1,1,1,1,1,1,1,1,1,1,1,1,"ALL",1,"ALL",1,"ALL",1,"ALL",1,1,1,1,1,1,1,1,1,1,1,1,1,1,1,1,1,1,1,1,1,1,1,1,1,1,1,1,1,1,1,1,"ALL",1,"ALL",1,1,"ALL",1,"ALL",1,1,1,"ALL",1,1,{"$f":"COUNTIF(D5:JN5,1)","v":240}]
[null,109056979,"Microsoft Dynamics CRM 2011 User CAL (Named User)","ALL",1,1,1,1,1,1,1,1,1,1,1,1,1,1,1,1,1,1,1,1,1,1,1,1,1,1,1,1,1,1,1,1,1,1,1,1,1,1,1,1,1,1,1,1,1,1,1,1,1,1,1,1,1,1,1,"ALL",1,1,1,1,"ALL",1,1,1,1,1,1,1,1,"ALL",1,1,"ALL",1,1,1,1,"ALL",1,1,1,1,1,"ALL",1,"ALL",1,"ALL",1,"ALL",1,1,1,"ALL",1,1,1,1,"ALL",1,1,1,1,1,"ALL",1,1,1,1,1,1,1,1,1,1,1,1,1,1,1,1,1,1,1,1,1,1,1,1,1,1,1,1,1,1,1,1,1,1,1,1,"ALL",1,"ALL",1,"ALL",1,1,1,1,1,1,1,1,1,1,1,1,1,1,1,1,1,1,1,1,1,"ALL",1,1,1,1,"ALL",1,"ALL",1,1,1,1,1,1,1,1,1,1,1,1,1,1,"ALL",1,1,1,1,"ALL",1,1,1,"ALL",1,1,1,1,1,1,1,1,1,1,1,1,1,1,1,1,1,1,"ALL",1,"ALL",1,"ALL",1,"ALL",1,1,1,1,1,1,1,1,1,1,1,1,1,1,1,1,1,1,1,1,1,1,1,1,1,1,1,1,1,1,1,1,"ALL",1,"ALL",1,1,"ALL",1,"ALL",1,1,1,"ALL",1,1,{"$f":"COUNTIF(D6:JN6,1)","v":240}]
[null,109056946,"Microsoft Dynamics CRM 2011 Device CAL (Device)","ALL",1,1,1,1,1,1,1,1,1,1,1,1,1,1,1,1,1,1,1,1,1,1,1,1,1,1,1,1,1,1,1,1,1,1,1,1,1,1,1,1,1,1,1,1,1,1,1,1,1,1,1,1,1,1,1,"ALL",1,1,1,1,"ALL",1,1,1,1,1,1,1,1,"ALL",1,1,"ALL",1,1,1,1,"ALL",1,1,1,1,1,"ALL",1,"ALL",1,"ALL",1,"ALL",1,1,1,"ALL",1,1,1,1,"ALL",1,1,1,1,1,"ALL",1,1,1,1,1,1,1,1,1,1,1,1,1,1,1,1,1,1,1,1,1,1,1,1,1,1,1,1,1,1,1,1,1,1,1,1,"ALL",1,"ALL",1,"ALL",1,1,1,1,1,1,1,1,1,1,1,1,1,1,1,1,1,1,1,1,1,"ALL",1,1,1,1,"ALL",1,"ALL",1,1,1,1,1,1,1,1,1,1,1,1,1,1,"ALL",1,1,1,1,"ALL",1,1,1,"ALL",1,1,1,1,1,1,1,1,1,1,1,1,1,1,1,1,1,1,"ALL",1,"ALL",1,"ALL",1,"ALL",1,1,1,1,1,1,1,1,1,1,1,1,1,1,1,1,1,1,1,1,1,1,1,1,1,1,1,1,1,1,1,1,"ALL",1,"ALL",1,1,"ALL",1,"ALL",1,1,1,"ALL",1,1,240]
[null,109056958,"Microsoft Dynamics CRM 2011 Full Use Additive User CAL (Named User)     ","ALL",1,1,1,1,1,1,1,1,1,1,1,1,1,1,1,1,1,1,1,1,1,1,1,1,1,1,1,1,1,1,1,1,1,1,1,1,1,1,1,1,1,1,1,1,1,1,1,1,1,1,1,1,1,1,1,"ALL",1,1,1,1,"ALL",1,1,1,1,1,1,1,1,"ALL",1,1,"ALL",1,1,1,1,"ALL",1,1,1,1,1,"ALL",1,"ALL",1,"ALL",1,"ALL",1,1,1,"ALL",1,1,1,1,"ALL",1,1,1,1,1,"ALL",1,1,1,1,1,1,1,1,1,1,1,1,1,1,1,1,1,1,1,1,1,1,1,1,1,1,1,1,1,1,1,1,1,1,1,1,"ALL",1,"ALL",1,"ALL",1,1,1,1,1,1,1,1,1,1,1,1,1,1,1,1,1,1,1,1,1,"ALL",1,1,1,1,"ALL",1,"ALL",1,1,1,1,1,1,1,1,1,1,1,1,1,1,"ALL",1,1,1,1,"ALL",1,1,1,"ALL",1,1,1,1,1,1,1,1,1,1,1,1,1,1,1,1,1,1,"ALL",1,"ALL",1,"ALL",1,"ALL",1,1,1,1,1,1,1,1,1,1,1,1,1,1,1,1,1,1,1,1,1,1,1,1,1,1,1,1,1,1,1,1,"ALL",1,"ALL",1,1,"ALL",1,"ALL",1,1,1,"ALL",1,1,240]
[null,109056954,"Microsoft Dynamics CRM 2011 Full Use Additive Device CAL     ","ALL",1,1,1,1,1,1,1,1,1,1,1,1,1,1,1,1,1,1,1,1,1,1,1,1,1,1,1,1,1,1,1,1,1,1,1,1,1,1,1,1,1,1,1,1,1,1,1,1,1,1,1,1,1,1,1,"ALL",1,1,1,1,"ALL",1,1,1,1,1,1,1,1,"ALL",1,1,"ALL",1,1,1,1,"ALL",1,1,1,1,1,"ALL",1,"ALL",1,"ALL",1,"ALL",1,1,1,"ALL",1,1,1,1,"ALL",1,1,1,1,1,"ALL",1,1,1,1,1,1,1,1,1,1,1,1,1,1,1,1,1,1,1,1,1,1,1,1,1,1,1,1,1,1,1,1,1,1,1,1,"ALL",1,"ALL",1,"ALL",1,1,1,1,1,1,1,1,1,1,1,1,1,1,1,1,1,1,1,1,1,"ALL",1,1,1,1,"ALL",1,"ALL",1,1,1,1,1,1,1,1,1,1,1,1,1,1,"ALL",1,1,1,1,"ALL",1,1,1,"ALL",1,1,1,1,1,1,1,1,1,1,1,1,1,1,1,1,1,1,"ALL",1,"ALL",1,"ALL",1,"ALL",1,1,1,1,1,1,1,1,1,1,1,1,1,1,1,1,1,1,1,1,1,1,1,1,1,1,1,1,1,1,1,1,"ALL",1,"ALL",1,1,"ALL",1,"ALL",1,1,1,"ALL",1,1,240]
[null,109056970,"Microsoft Dynamics CRM 2011 Limited User CAL (Named User)              ","ALL",1,1,1,1,1,1,1,1,1,1,1,1,1,1,1,1,1,1,1,1,1,1,1,1,1,1,1,1,1,1,1,1,1,1,1,1,1,1,1,1,1,1,1,1,1,1,1,1,1,1,1,1,1,1,1,"ALL",1,1,1,1,"ALL",1,1,1,1,1,1,1,1,"ALL",1,1,"ALL",1,1,1,1,"ALL",1,1,1,1,1,"ALL",1,"ALL",1,"ALL",1,"ALL",1,1,1,"ALL",1,1,1,1,"ALL",1,1,1,1,1,"ALL",1,1,1,1,1,1,1,1,1,1,1,1,1,1,1,1,1,1,1,1,1,1,1,1,1,1,1,1,1,1,1,1,1,1,1,1,"ALL",1,"ALL",1,"ALL",1,1,1,1,1,1,1,1,1,1,1,1,1,1,1,1,1,1,1,1,1,"ALL",1,1,1,1,"ALL",1,"ALL",1,1,1,1,1,1,1,1,1,1,1,1,1,1,"ALL",1,1,1,1,"ALL",1,1,1,"ALL",1,1,1,1,1,1,1,1,1,1,1,1,1,1,1,1,1,1,"ALL",1,"ALL",1,"ALL",1,"ALL",1,1,1,1,1,1,1,1,1,1,1,1,1,1,1,1,1,1,1,1,1,1,1,1,1,1,1,1,1,1,1,1,"ALL",1,"ALL",1,1,"ALL",1,"ALL",1,1,1,"ALL",1,1,240]
[null,109056967,"Microsoft Dynamics CRM 2011 Limited Device CAL","ALL",1,1,1,1,1,1,1,1,1,1,1,1,1,1,1,1,1,1,1,1,1,1,1,1,1,1,1,1,1,1,1,1,1,1,1,1,1,1,1,1,1,1,1,1,1,1,1,1,1,1,1,1,1,1,1,"ALL",1,1,1,1,"ALL",1,1,1,1,1,1,1,1,"ALL",1,1,"ALL",1,1,1,1,"ALL",1,1,1,1,1,"ALL",1,"ALL",1,"ALL",1,"ALL",1,1,1,"ALL",1,1,1,1,"ALL",1,1,1,1,1,"ALL",1,1,1,1,1,1,1,1,1,1,1,1,1,1,1,1,1,1,1,1,1,1,1,1,1,1,1,1,1,1,1,1,1,1,1,1,"ALL",1,"ALL",1,"ALL",1,1,1,1,1,1,1,1,1,1,1,1,1,1,1,1,1,1,1,1,1,"ALL",1,1,1,1,"ALL",1,"ALL",1,1,1,1,1,1,1,1,1,1,1,1,1,1,"ALL",1,1,1,1,"ALL",1,1,1,"ALL",1,1,1,1,1,1,1,1,1,1,1,1,1,1,1,1,1,1,"ALL",1,"ALL",1,"ALL",1,"ALL",1,1,1,1,1,1,1,1,1,1,1,1,1,1,1,1,1,1,1,1,1,1,1,1,1,1,1,1,1,1,1,1,"ALL",1,"ALL",1,1,"ALL",1,"ALL",1,1,1,"ALL",1,1,240]
[null,109057081,"Microsoft Dynamics CRM 2011 Limited Use Additive User CAL","ALL",1,1,1,1,1,1,1,1,1,1,1,1,1,1,1,1,1,1,1,1,1,1,1,1,1,1,1,1,1,1,1,1,1,1,1,1,1,1,1,1,1,1,1,1,1,1,1,1,1,1,1,1,1,1,1,"ALL",1,1,1,1,"ALL",1,1,1,1,1,1,1,1,"ALL",1,1,"ALL",1,1,1,1,"ALL",1,1,1,1,1,"ALL",1,"ALL",1,"ALL",1,"ALL",1,1,1,"ALL",1,1,1,1,"ALL",1,1,1,1,1,"ALL",1,1,1,1,1,1,1,1,1,1,1,1,1,1,1,1,1,1,1,1,1,1,1,1,1,1,1,1,1,1,1,1,1,1,1,1,"ALL",1,"ALL",1,"ALL",1,1,1,1,1,1,1,1,1,1,1,1,1,1,1,1,1,1,1,1,1,"ALL",1,1,1,1,"ALL",1,"ALL",1,1,1,1,1,1,1,1,1,1,1,1,1,1,"ALL",1,1,1,1,"ALL",1,1,1,"ALL",1,1,1,1,1,1,1,1,1,1,1,1,1,1,1,1,1,1,"ALL",1,"ALL",1,"ALL",1,"ALL",1,1,1,1,1,1,1,1,1,1,1,1,1,1,1,1,1,1,1,1,1,1,1,1,1,1,1,1,1,1,1,1,"ALL",1,"ALL",1,1,"ALL",1,"ALL",1,1,1,"ALL",1,1,240]
[null,109057082,"Microsoft Dynamics CRM 2011 Limited Use Additive Device CAL","ALL",1,1,1,1,1,1,1,1,1,1,1,1,1,1,1,1,1,1,1,1,1,1,1,1,1,1,1,1,1,1,1,1,1,1,1,1,1,1,1,1,1,1,1,1,1,1,1,1,1,1,1,1,1,1,1,"ALL",1,1,1,1,"ALL",1,1,1,1,1,1,1,1,"ALL",1,1,"ALL",1,1,1,1,"ALL",1,1,1,1,1,"ALL",1,"ALL",1,"ALL",1,"ALL",1,1,1,"ALL",1,1,1,1,"ALL",1,1,1,1,1,"ALL",1,1,1,1,1,1,1,1,1,1,1,1,1,1,1,1,1,1,1,1,1,1,1,1,1,1,1,1,1,1,1,1,1,1,1,1,"ALL",1,"ALL",1,"ALL",1,1,1,1,1,1,1,1,1,1,1,1,1,1,1,1,1,1,1,1,1,"ALL",1,1,1,1,"ALL",1,"ALL",1,1,1,1,1,1,1,1,1,1,1,1,1,1,"ALL",1,1,1,1,"ALL",1,1,1,"ALL",1,1,1,1,1,1,1,1,1,1,1,1,1,1,1,1,1,1,"ALL",1,"ALL",1,"ALL",1,"ALL",1,1,1,1,1,1,1,1,1,1,1,1,1,1,1,1,1,1,1,1,1,1,1,1,1,1,1,1,1,1,1,1,"ALL",1,"ALL",1,1,"ALL",1,"ALL",1,1,1,"ALL",1,1,240]
[null,109057079,"Microsoft Dynamics CRM 2011 Employee Self Service User CAL","ALL",1,1,1,1,1,1,1,1,1,1,1,1,1,1,1,1,1,1,1,1,1,1,1,1,1,1,1,1,1,1,1,1,1,1,1,1,1,1,1,1,1,1,1,1,1,1,1,1,1,1,1,1,1,1,1,"ALL",1,1,1,1,"ALL",1,1,1,1,1,1,1,1,"ALL",1,1,"ALL",1,1,1,1,"ALL",1,1,1,1,1,"ALL",1,"ALL",1,"ALL",1,"ALL",1,1,1,"ALL",1,1,1,1,"ALL",1,1,1,1,1,"ALL",1,1,1,1,1,1,1,1,1,1,1,1,1,1,1,1,1,1,1,1,1,1,1,1,1,1,1,1,1,1,1,1,1,1,1,1,"ALL",1,"ALL",1,"ALL",1,1,1,1,1,1,1,1,1,1,1,1,1,1,1,1,1,1,1,1,1,"ALL",1,1,1,1,"ALL",1,"ALL",1,1,1,1,1,1,1,1,1,1,1,1,1,1,"ALL",1,1,1,1,"ALL",1,1,1,"ALL",1,1,1,1,1,1,1,1,1,1,1,1,1,1,1,1,1,1,"ALL",1,"ALL",1,"ALL",1,"ALL",1,1,1,1,1,1,1,1,1,1,1,1,1,1,1,1,1,1,1,1,1,1,1,1,1,1,1,1,1,1,1,1,"ALL",1,"ALL",1,1,"ALL",1,"ALL",1,1,1,"ALL",1,1,240]
[null,109057074,"Microsoft Dynamics CRM 2011 Employee Self Service Device CAL","ALL",1,1,1,1,1,1,1,1,1,1,1,1,1,1,1,1,1,1,1,1,1,1,1,1,1,1,1,1,1,1,1,1,1,1,1,1,1,1,1,1,1,1,1,1,1,1,1,1,1,1,1,1,1,1,1,"ALL",1,1,1,1,"ALL",1,1,1,1,1,1,1,1,"ALL",1,1,"ALL",1,1,1,1,"ALL",1,1,1,1,1,"ALL",1,"ALL",1,"ALL",1,"ALL",1,1,1,"ALL",1,1,1,1,"ALL",1,1,1,1,1,"ALL",1,1,1,1,1,1,1,1,1,1,1,1,1,1,1,1,1,1,1,1,1,1,1,1,1,1,1,1,1,1,1,1,1,1,1,1,"ALL",1,"ALL",1,"ALL",1,1,1,1,1,1,1,1,1,1,1,1,1,1,1,1,1,1,1,1,1,"ALL",1,1,1,1,"ALL",1,"ALL",1,1,1,1,1,1,1,1,1,1,1,1,1,1,"ALL",1,1,1,1,"ALL",1,1,1,"ALL",1,1,1,1,1,1,1,1,1,1,1,1,1,1,1,1,1,1,"ALL",1,"ALL",1,"ALL",1,"ALL",1,1,1,1,1,1,1,1,1,1,1,1,1,1,1,1,1,1,1,1,1,1,1,1,1,1,1,1,1,1,1,1,"ALL",1,"ALL",1,1,"ALL",1,"ALL",1,1,1,"ALL",1,1,240]
[null,109056950,"Microsoft Dynamics CRM 2011 External Connector ","ALL",1,1,1,1,1,1,1,1,1,1,1,1,1,1,1,1,1,1,1,1,1,1,1,1,1,1,1,1,1,1,1,1,1,1,1,1,1,1,1,1,1,1,1,1,1,1,1,1,1,1,1,1,1,1,1,"ALL",1,1,1,1,"ALL",1,1,1,1,1,1,1,1,"ALL",1,1,"ALL",1,1,1,1,"ALL",1,1,1,1,1,"ALL",1,"ALL",1,"ALL",1,"ALL",1,1,1,"ALL",1,1,1,1,"ALL",1,1,1,1,1,"ALL",1,1,1,1,1,1,1,1,1,1,1,1,1,1,1,1,1,1,1,1,1,1,1,1,1,1,1,1,1,1,1,1,1,1,1,1,"ALL",1,"ALL",1,"ALL",1,1,1,1,1,1,1,1,1,1,1,1,1,1,1,1,1,1,1,1,1,"ALL",1,1,1,1,"ALL",1,"ALL",1,1,1,1,1,1,1,1,1,1,1,1,1,1,"ALL",1,1,1,1,"ALL",1,1,1,"ALL",1,1,1,1,1,1,1,1,1,1,1,1,1,1,1,1,1,1,"ALL",1,"ALL",1,"ALL",1,"ALL",1,1,1,1,1,1,1,1,1,1,1,1,1,1,1,1,1,1,1,1,1,1,1,1,1,1,1,1,1,1,1,1,"ALL",1,"ALL",1,1,"ALL",1,"ALL",1,1,1,"ALL",1,1,240]
[null,109056938,"Language: Arabic","ALL",1,1,1,1,1,1,1,1,1,1,1,1,1,1,1,1,1,1,1,1,1,1,1,1,1,1,1,1,1,1,1,1,1,1,1,1,1,1,1,1,1,1,1,1,1,1,1,1,1,1,1,1,1,1,1,"ALL",1,1,1,1,"ALL",1,1,1,1,1,1,1,1,"ALL",1,1,"ALL",1,1,1,1,"ALL",1,1,1,1,1,"ALL",1,"ALL",1,"ALL",1,"ALL",1,1,1,"ALL",1,1,1,1,"ALL",1,1,1,1,1,"ALL",1,1,1,1,1,1,1,1,1,1,1,1,1,1,1,1,1,1,1,1,1,1,1,1,1,1,1,1,1,1,1,1,1,1,1,1,"ALL",1,"ALL",1,"ALL",1,1,1,1,1,1,1,1,1,1,1,1,1,1,1,1,1,1,1,1,1,"ALL",1,1,1,1,"ALL",1,"ALL",1,1,1,1,1,1,1,1,1,1,1,1,1,1,"ALL",1,1,1,1,"ALL",1,1,1,"ALL",1,1,1,1,1,1,1,1,1,1,1,1,1,1,1,1,1,1,"ALL",1,"ALL",1,"ALL",1,"ALL",1,1,1,1,1,1,1,1,1,1,1,1,1,1,1,1,1,1,1,1,1,1,1,1,1,1,1,1,1,1,1,1,"ALL",1,"ALL",1,1,"ALL",1,"ALL",1,1,1,"ALL",1,1,240]
[null,109057049,"Language: Portuguese (Brazil)","ALL",1,1,1,1,1,1,1,1,1,1,1,1,1,1,1,1,1,1,1,1,1,1,1,1,1,1,1,1,1,1,1,1,1,1,1,1,1,1,1,1,1,1,1,1,1,1,1,1,1,1,1,1,1,1,1,"ALL",1,1,1,1,"ALL",1,1,1,1,1,1,1,1,"ALL",1,1,"ALL",1,1,1,1,"ALL",1,1,1,1,1,"ALL",1,"ALL",1,"ALL",1,"ALL",1,1,1,"ALL",1,1,1,1,"ALL",1,1,1,1,1,"ALL",1,1,1,1,1,1,1,1,1,1,1,1,1,1,1,1,1,1,1,1,1,1,1,1,1,1,1,1,1,1,1,1,1,1,1,1,"ALL",1,"ALL",1,"ALL",1,1,1,1,1,1,1,1,1,1,1,1,1,1,1,1,1,1,1,1,1,"ALL",1,1,1,1,"ALL",1,"ALL",1,1,1,1,1,1,1,1,1,1,1,1,1,1,"ALL",1,1,1,1,"ALL",1,1,1,"ALL",1,1,1,1,1,1,1,1,1,1,1,1,1,1,1,1,1,1,"ALL",1,"ALL",1,"ALL",1,"ALL",1,1,1,1,1,1,1,1,1,1,1,1,1,1,1,1,1,1,1,1,1,1,1,1,1,1,1,1,1,1,1,1,"ALL",1,"ALL",1,1,"ALL",1,"ALL",1,1,1,"ALL",1,1,240]
[null,109056982,"Language: Chinese Simplified","ALL",1,1,1,1,1,1,1,1,1,1,1,1,1,1,1,1,1,1,1,1,1,1,1,1,1,1,1,1,1,1,1,1,1,1,1,1,1,1,1,1,1,1,1,1,1,1,1,1,1,1,1,1,1,1,1,"ALL",1,1,1,1,"ALL",1,1,1,1,1,1,1,1,"ALL",1,1,"ALL",1,1,1,1,"ALL",1,1,1,1,1,"ALL",1,"ALL",1,"ALL",1,"ALL",1,1,1,"ALL",1,1,1,1,"ALL",1,1,1,1,1,"ALL",1,1,1,1,1,1,1,1,1,1,1,1,1,1,1,1,1,1,1,1,1,1,1,1,1,1,1,1,1,1,1,1,1,1,1,1,"ALL",1,"ALL",1,"ALL",1,1,1,1,1,1,1,1,1,1,1,1,1,1,1,1,1,1,1,1,1,"ALL",1,1,1,1,"ALL",1,"ALL",1,1,1,1,1,1,1,1,1,1,1,1,1,1,"ALL",1,1,1,1,"ALL",1,1,1,"ALL",1,1,1,1,1,1,1,1,1,1,1,1,1,1,1,1,1,1,"ALL",1,"ALL",1,"ALL",1,"ALL",1,1,1,1,1,1,1,1,1,1,1,1,1,1,1,1,1,1,1,1,1,1,1,1,1,1,1,1,1,1,1,1,"ALL",1,"ALL",1,1,"ALL",1,"ALL",1,1,1,"ALL",1,1,240]
[null,109056984,"Language: Chinese Traditional","ALL",1,1,1,1,1,1,1,1,1,1,1,1,1,1,1,1,1,1,1,1,1,1,1,1,1,1,1,1,1,1,1,1,1,1,1,1,1,1,1,1,1,1,1,1,1,1,1,1,1,1,1,1,1,1,1,"ALL",1,1,1,1,"ALL",1,1,1,1,1,1,1,1,"ALL",1,1,"ALL",1,1,1,1,"ALL",1,1,1,1,1,"ALL",1,"ALL",1,"ALL",1,"ALL",1,1,1,"ALL",1,1,1,1,"ALL",1,1,1,1,1,"ALL",1,1,1,1,1,1,1,1,1,1,1,1,1,1,1,1,1,1,1,1,1,1,1,1,1,1,1,1,1,1,1,1,1,1,1,1,"ALL",1,"ALL",1,"ALL",1,1,1,1,1,1,1,1,1,1,1,1,1,1,1,1,1,1,1,1,1,"ALL",1,1,1,1,"ALL",1,"ALL",1,1,1,1,1,1,1,1,1,1,1,1,1,1,"ALL",1,1,1,1,"ALL",1,1,1,"ALL",1,1,1,1,1,1,1,1,1,1,1,1,1,1,1,1,1,1,"ALL",1,"ALL",1,"ALL",1,"ALL",1,1,1,1,1,1,1,1,1,1,1,1,1,1,1,1,1,1,1,1,1,1,1,1,1,1,1,1,1,1,1,1,"ALL",1,"ALL",1,1,"ALL",1,"ALL",1,1,1,"ALL",1,1,240]
[null,109056983,"Language: Chinese (Hong Kong SAR)","ALL",1,1,1,1,1,1,1,1,1,1,1,1,1,1,1,1,1,1,1,1,1,1,1,1,1,1,1,1,1,1,1,1,1,1,1,1,1,1,1,1,1,1,1,1,1,1,1,1,1,1,1,1,1,1,1,"ALL",1,1,1,1,"ALL",1,1,1,1,1,1,1,1,"ALL",1,1,"ALL",1,1,1,1,"ALL",1,1,1,1,1,"ALL",1,"ALL",1,"ALL",1,"ALL",1,1,1,"ALL",1,1,1,1,"ALL",1,1,1,1,1,"ALL",1,1,1,1,1,1,1,1,1,1,1,1,1,1,1,1,1,1,1,1,1,1,1,1,1,1,1,1,1,1,1,1,1,1,1,1,"ALL",1,"ALL",1,"ALL",1,1,1,1,1,1,1,1,1,1,1,1,1,1,1,1,1,1,1,1,1,"ALL",1,1,1,1,"ALL",1,"ALL",1,1,1,1,1,1,1,1,1,1,1,1,1,1,"ALL",1,1,1,1,"ALL",1,1,1,"ALL",1,1,1,1,1,1,1,1,1,1,1,1,1,1,1,1,1,1,"ALL",1,"ALL",1,"ALL",1,"ALL",1,1,1,1,1,1,1,1,1,1,1,1,1,1,1,1,1,1,1,1,1,1,1,1,1,1,1,1,1,1,1,1,"ALL",1,"ALL",1,1,"ALL",1,"ALL",1,1,1,"ALL",1,1,240]
[null,109056985,"Language: Czech","ALL",1,1,1,1,1,1,1,1,1,1,1,1,1,1,1,1,1,1,1,1,1,1,1,1,1,1,1,1,1,1,1,1,1,1,1,1,1,1,1,1,1,1,1,1,1,1,1,1,1,1,1,1,1,1,1,"ALL",1,1,1,1,"ALL",1,1,1,1,1,1,1,1,"ALL",1,1,"ALL",1,1,1,1,"ALL",1,1,1,1,1,"ALL",1,"ALL",1,"ALL",1,"ALL",1,1,1,"ALL",1,1,1,1,"ALL",1,1,1,1,1,"ALL",1,1,1,1,1,1,1,1,1,1,1,1,1,1,1,1,1,1,1,1,1,1,1,1,1,1,1,1,1,1,1,1,1,1,1,1,"ALL",1,"ALL",1,"ALL",1,1,1,1,1,1,1,1,1,1,1,1,1,1,1,1,1,1,1,1,1,"ALL",1,1,1,1,"ALL",1,"ALL",1,1,1,1,1,1,1,1,1,1,1,1,1,1,"ALL",1,1,1,1,"ALL",1,1,1,"ALL",1,1,1,1,1,1,1,1,1,1,1,1,1,1,1,1,1,1,"ALL",1,"ALL",1,"ALL",1,"ALL",1,1,1,1,1,1,1,1,1,1,1,1,1,1,1,1,1,1,1,1,1,1,1,1,1,1,1,1,1,1,1,1,"ALL",1,"ALL",1,1,"ALL",1,"ALL",1,1,1,"ALL",1,1,240]
[null,109056986,"Language: Danish","ALL",1,1,1,1,1,1,1,1,1,1,1,1,1,1,1,1,1,1,1,1,1,1,1,1,1,1,1,1,1,1,1,1,1,1,1,1,1,1,1,1,1,1,1,1,1,1,1,1,1,1,1,1,1,1,1,"ALL",1,1,1,1,"ALL",1,1,1,1,1,1,1,1,"ALL",1,1,"ALL",1,1,1,1,"ALL",1,1,1,1,1,"ALL",1,"ALL",1,"ALL",1,"ALL",1,1,1,"ALL",1,1,1,1,"ALL",1,1,1,1,1,"ALL",1,1,1,1,1,1,1,1,1,1,1,1,1,1,1,1,1,1,1,1,1,1,1,1,1,1,1,1,1,1,1,1,1,1,1,1,"ALL",1,"ALL",1,"ALL",1,1,1,1,1,1,1,1,1,1,1,1,1,1,1,1,1,1,1,1,1,"ALL",1,1,1,1,"ALL",1,"ALL",1,1,1,1,1,1,1,1,1,1,1,1,1,1,"ALL",1,1,1,1,"ALL",1,1,1,"ALL",1,1,1,1,1,1,1,1,1,1,1,1,1,1,1,1,1,1,"ALL",1,"ALL",1,"ALL",1,"ALL",1,1,1,1,1,1,1,1,1,1,1,1,1,1,1,1,1,1,1,1,1,1,1,1,1,1,1,1,1,1,1,1,"ALL",1,"ALL",1,1,"ALL",1,"ALL",1,1,1,"ALL",1,1,240]
[null,109056948,"Language: Dutch","ALL",1,1,1,1,1,1,1,1,1,1,1,1,1,1,1,1,1,1,1,1,1,1,1,1,1,1,1,1,1,1,1,1,1,1,1,1,1,1,1,1,1,1,1,1,1,1,1,1,1,1,1,1,1,1,1,"ALL",1,1,1,1,"ALL",1,1,1,1,1,1,1,1,"ALL",1,1,"ALL",1,1,1,1,"ALL",1,1,1,1,1,"ALL",1,"ALL",1,"ALL",1,"ALL",1,1,1,"ALL",1,1,1,1,"ALL",1,1,1,1,1,"ALL",1,1,1,1,1,1,1,1,1,1,1,1,1,1,1,1,1,1,1,1,1,1,1,1,1,1,1,1,1,1,1,1,1,1,1,1,"ALL",1,"ALL",1,"ALL",1,1,1,1,1,1,1,1,1,1,1,1,1,1,1,1,1,1,1,1,1,"ALL",1,1,1,1,"ALL",1,"ALL",1,1,1,1,1,1,1,1,1,1,1,1,1,1,"ALL",1,1,1,1,"ALL",1,1,1,"ALL",1,1,1,1,1,1,1,1,1,1,1,1,1,1,1,1,1,1,"ALL",1,"ALL",1,"ALL",1,"ALL",1,1,1,1,1,1,1,1,1,1,1,1,1,1,1,1,1,1,1,1,1,1,1,1,1,1,1,1,1,1,1,1,"ALL",1,"ALL",1,1,"ALL",1,"ALL",1,1,1,"ALL",1,1,240]
[null,109056949,"Language: English","ALL",1,1,1,1,1,1,1,1,1,1,1,1,1,1,1,1,1,1,1,1,1,1,1,1,1,1,1,1,1,1,1,1,1,1,1,1,1,1,1,1,1,1,1,1,1,1,1,1,1,1,1,1,1,1,1,"ALL",1,1,1,1,"ALL",1,1,1,1,1,1,1,1,"ALL",1,1,"ALL",1,1,1,1,"ALL",1,1,1,1,1,"ALL",1,"ALL",1,"ALL",1,"ALL",1,1,1,"ALL",1,1,1,1,"ALL",1,1,1,1,1,"ALL",1,1,1,1,1,1,1,1,1,1,1,1,1,1,1,1,1,1,1,1,1,1,1,1,1,1,1,1,1,1,1,1,1,1,1,1,"ALL",1,"ALL",1,"ALL",1,1,1,1,1,1,1,1,1,1,1,1,1,1,1,1,1,1,1,1,1,"ALL",1,1,1,1,"ALL",1,"ALL",1,1,1,1,1,1,1,1,1,1,1,1,1,1,"ALL",1,1,1,1,"ALL",1,1,1,"ALL",1,1,1,1,1,1,1,1,1,1,1,1,1,1,1,1,1,1,"ALL",1,"ALL",1,"ALL",1,"ALL",1,1,1,1,1,1,1,1,1,1,1,1,1,1,1,1,1,1,1,1,1,1,1,1,1,1,1,1,1,1,1,1,"ALL",1,"ALL",1,1,"ALL",1,"ALL",1,1,1,"ALL",1,1,240]
[null,109056952,"Language: Finnish","ALL",1,1,1,1,1,1,1,1,1,1,1,1,1,1,1,1,1,1,1,1,1,1,1,1,1,1,1,1,1,1,1,1,1,1,1,1,1,1,1,1,1,1,1,1,1,1,1,1,1,1,1,1,1,1,1,"ALL",1,1,1,1,"ALL",1,1,1,1,1,1,1,1,"ALL",1,1,"ALL",1,1,1,1,"ALL",1,1,1,1,1,"ALL",1,"ALL",1,"ALL",1,"ALL",1,1,1,"ALL",1,1,1,1,"ALL",1,1,1,1,1,"ALL",1,1,1,1,1,1,1,1,1,1,1,1,1,1,1,1,1,1,1,1,1,1,1,1,1,1,1,1,1,1,1,1,1,1,1,1,"ALL",1,"ALL",1,"ALL",1,1,1,1,1,1,1,1,1,1,1,1,1,1,1,1,1,1,1,1,1,"ALL",1,1,1,1,"ALL",1,"ALL",1,1,1,1,1,1,1,1,1,1,1,1,1,1,"ALL",1,1,1,1,"ALL",1,1,1,"ALL",1,1,1,1,1,1,1,1,1,1,1,1,1,1,1,1,1,1,"ALL",1,"ALL",1,"ALL",1,"ALL",1,1,1,1,1,1,1,1,1,1,1,1,1,1,1,1,1,1,1,1,1,1,1,1,1,1,1,1,1,1,1,1,"ALL",1,"ALL",1,1,"ALL",1,"ALL",1,1,1,"ALL",1,1,240]
[null,109056953,"Language: French","ALL",1,1,1,1,1,1,1,1,1,1,1,1,1,1,1,1,1,1,1,1,1,1,1,1,1,1,1,1,1,1,1,1,1,1,1,1,1,1,1,1,1,1,1,1,1,1,1,1,1,1,1,1,1,1,1,"ALL",1,1,1,1,"ALL",1,1,1,1,1,1,1,1,"ALL",1,1,"ALL",1,1,1,1,"ALL",1,1,1,1,1,"ALL",1,"ALL",1,"ALL",1,"ALL",1,1,1,"ALL",1,1,1,1,"ALL",1,1,1,1,1,"ALL",1,1,1,1,1,1,1,1,1,1,1,1,1,1,1,1,1,1,1,1,1,1,1,1,1,1,1,1,1,1,1,1,1,1,1,1,"ALL",1,"ALL",1,"ALL",1,1,1,1,1,1,1,1,1,1,1,1,1,1,1,1,1,1,1,1,1,"ALL",1,1,1,1,"ALL",1,"ALL",1,1,1,1,1,1,1,1,1,1,1,1,1,1,"ALL",1,1,1,1,"ALL",1,1,1,"ALL",1,1,1,1,1,1,1,1,1,1,1,1,1,1,1,1,1,1,"ALL",1,"ALL",1,"ALL",1,"ALL",1,1,1,1,1,1,1,1,1,1,1,1,1,1,1,1,1,1,1,1,1,1,1,1,1,1,1,1,1,1,1,1,"ALL",1,"ALL",1,1,"ALL",1,"ALL",1,1,1,"ALL",1,1,240]
[null,109056960,"Language: German","ALL",1,1,1,1,1,1,1,1,1,1,1,1,1,1,1,1,1,1,1,1,1,1,1,1,1,1,1,1,1,1,1,1,1,1,1,1,1,1,1,1,1,1,1,1,1,1,1,1,1,1,1,1,1,1,1,"ALL",1,1,1,1,"ALL",1,1,1,1,1,1,1,1,"ALL",1,1,"ALL",1,1,1,1,"ALL",1,1,1,1,1,"ALL",1,"ALL",1,"ALL",1,"ALL",1,1,1,"ALL",1,1,1,1,"ALL",1,1,1,1,1,"ALL",1,1,1,1,1,1,1,1,1,1,1,1,1,1,1,1,1,1,1,1,1,1,1,1,1,1,1,1,1,1,1,1,1,1,1,1,"ALL",1,"ALL",1,"ALL",1,1,1,1,1,1,1,1,1,1,1,1,1,1,1,1,1,1,1,1,1,"ALL",1,1,1,1,"ALL",1,"ALL",1,1,1,1,1,1,1,1,1,1,1,1,1,1,"ALL",1,1,1,1,"ALL",1,1,1,"ALL",1,1,1,1,1,1,1,1,1,1,1,1,1,1,1,1,1,1,"ALL",1,"ALL",1,"ALL",1,"ALL",1,1,1,1,1,1,1,1,1,1,1,1,1,1,1,1,1,1,1,1,1,1,1,1,1,1,1,1,1,1,1,1,"ALL",1,"ALL",1,1,"ALL",1,"ALL",1,1,1,"ALL",1,1,240]
[null,109056961,"Language: Greek","ALL",1,1,1,1,1,1,1,1,1,1,1,1,1,1,1,1,1,1,1,1,1,1,1,1,1,1,1,1,1,1,1,1,1,1,1,1,1,1,1,1,1,1,1,1,1,1,1,1,1,1,1,1,1,1,1,"ALL",1,1,1,1,"ALL",1,1,1,1,1,1,1,1,"ALL",1,1,"ALL",1,1,1,1,"ALL",1,1,1,1,1,"ALL",1,"ALL",1,"ALL",1,"ALL",1,1,1,"ALL",1,1,1,1,"ALL",1,1,1,1,1,"ALL",1,1,1,1,1,1,1,1,1,1,1,1,1,1,1,1,1,1,1,1,1,1,1,1,1,1,1,1,1,1,1,1,1,1,1,1,"ALL",1,"ALL",1,"ALL",1,1,1,1,1,1,1,1,1,1,1,1,1,1,1,1,1,1,1,1,1,"ALL",1,1,1,1,"ALL",1,"ALL",1,1,1,1,1,1,1,1,1,1,1,1,1,1,"ALL",1,1,1,1,"ALL",1,1,1,"ALL",1,1,1,1,1,1,1,1,1,1,1,1,1,1,1,1,1,1,"ALL",1,"ALL",1,"ALL",1,"ALL",1,1,1,1,1,1,1,1,1,1,1,1,1,1,1,1,1,1,1,1,1,1,1,1,1,1,1,1,1,1,1,1,"ALL",1,"ALL",1,1,"ALL",1,"ALL",1,1,1,"ALL",1,1,240]
[null,109056962,"Language: Hebrew","ALL",1,1,1,1,1,1,1,1,1,1,1,1,1,1,1,1,1,1,1,1,1,1,1,1,1,1,1,1,1,1,1,1,1,1,1,1,1,1,1,1,1,1,1,1,1,1,1,1,1,1,1,1,1,1,1,"ALL",1,1,1,1,"ALL",1,1,1,1,1,1,1,1,"ALL",1,1,"ALL",1,1,1,1,"ALL",1,1,1,1,1,"ALL",1,"ALL",1,"ALL",1,"ALL",1,1,1,"ALL",1,1,1,1,"ALL",1,1,1,1,1,"ALL",1,1,1,1,1,1,1,1,1,1,1,1,1,1,1,1,1,1,1,1,1,1,1,1,1,1,1,1,1,1,1,1,1,1,1,1,"ALL",1,"ALL",1,"ALL",1,1,1,1,1,1,1,1,1,1,1,1,1,1,1,1,1,1,1,1,1,"ALL",1,1,1,1,"ALL",1,"ALL",1,1,1,1,1,1,1,1,1,1,1,1,1,1,"ALL",1,1,1,1,"ALL",1,1,1,"ALL",1,1,1,1,1,1,1,1,1,1,1,1,1,1,1,1,1,1,"ALL",1,"ALL",1,"ALL",1,"ALL",1,1,1,1,1,1,1,1,1,1,1,1,1,1,1,1,1,1,1,1,1,1,1,1,1,1,1,1,1,1,1,1,"ALL",1,"ALL",1,1,"ALL",1,"ALL",1,1,1,"ALL",1,1,240]
[null,109056963,"Language: Hungarian","ALL",1,1,1,1,1,1,1,1,1,1,1,1,1,1,1,1,1,1,1,1,1,1,1,1,1,1,1,1,1,1,1,1,1,1,1,1,1,1,1,1,1,1,1,1,1,1,1,1,1,1,1,1,1,1,1,"ALL",1,1,1,1,"ALL",1,1,1,1,1,1,1,1,"ALL",1,1,"ALL",1,1,1,1,"ALL",1,1,1,1,1,"ALL",1,"ALL",1,"ALL",1,"ALL",1,1,1,"ALL",1,1,1,1,"ALL",1,1,1,1,1,"ALL",1,1,1,1,1,1,1,1,1,1,1,1,1,1,1,1,1,1,1,1,1,1,1,1,1,1,1,1,1,1,1,1,1,1,1,1,"ALL",1,"ALL",1,"ALL",1,1,1,1,1,1,1,1,1,1,1,1,1,1,1,1,1,1,1,1,1,"ALL",1,1,1,1,"ALL",1,"ALL",1,1,1,1,1,1,1,1,1,1,1,1,1,1,"ALL",1,1,1,1,"ALL",1,1,1,"ALL",1,1,1,1,1,1,1,1,1,1,1,1,1,1,1,1,1,1,"ALL",1,"ALL",1,"ALL",1,"ALL",1,1,1,1,1,1,1,1,1,1,1,1,1,1,1,1,1,1,1,1,1,1,1,1,1,1,1,1,1,1,1,1,"ALL",1,"ALL",1,1,"ALL",1,"ALL",1,1,1,"ALL",1,1,240]
[null,109056964,"Language: Italian","ALL",1,1,1,1,1,1,1,1,1,1,1,1,1,1,1,1,1,1,1,1,1,1,1,1,1,1,1,1,1,1,1,1,1,1,1,1,1,1,1,1,1,1,1,1,1,1,1,1,1,1,1,1,1,1,1,"ALL",1,1,1,1,"ALL",1,1,1,1,1,1,1,1,"ALL",1,1,"ALL",1,1,1,1,"ALL",1,1,1,1,1,"ALL",1,"ALL",1,"ALL",1,"ALL",1,1,1,"ALL",1,1,1,1,"ALL",1,1,1,1,1,"ALL",1,1,1,1,1,1,1,1,1,1,1,1,1,1,1,1,1,1,1,1,1,1,1,1,1,1,1,1,1,1,1,1,1,1,1,1,"ALL",1,"ALL",1,"ALL",1,1,1,1,1,1,1,1,1,1,1,1,1,1,1,1,1,1,1,1,1,"ALL",1,1,1,1,"ALL",1,"ALL",1,1,1,1,1,1,1,1,1,1,1,1,1,1,"ALL",1,1,1,1,"ALL",1,1,1,"ALL",1,1,1,1,1,1,1,1,1,1,1,1,1,1,1,1,1,1,"ALL",1,"ALL",1,"ALL",1,"ALL",1,1,1,1,1,1,1,1,1,1,1,1,1,1,1,1,1,1,1,1,1,1,1,1,1,1,1,1,1,1,1,1,"ALL",1,"ALL",1,1,"ALL",1,"ALL",1,1,1,"ALL",1,1,240]
[null,109056965,"Language: Japanese","ALL",1,1,1,1,1,1,1,1,1,1,1,1,1,1,1,1,1,1,1,1,1,1,1,1,1,1,1,1,1,1,1,1,1,1,1,1,1,1,1,1,1,1,1,1,1,1,1,1,1,1,1,1,1,1,1,"ALL",1,1,1,1,"ALL",1,1,1,1,1,1,1,1,"ALL",1,1,"ALL",1,1,1,1,"ALL",1,1,1,1,1,"ALL",1,"ALL",1,"ALL",1,"ALL",1,1,1,"ALL",1,1,1,1,"ALL",1,1,1,1,1,"ALL",1,1,1,1,1,1,1,1,1,1,1,1,1,1,1,1,1,1,1,1,1,1,1,1,1,1,1,1,1,1,1,1,1,1,1,1,"ALL",1,"ALL",1,"ALL",1,1,1,1,1,1,1,1,1,1,1,1,1,1,1,1,1,1,1,1,1,"ALL",1,1,1,1,"ALL",1,"ALL",1,1,1,1,1,1,1,1,1,1,1,1,1,1,"ALL",1,1,1,1,"ALL",1,1,1,"ALL",1,1,1,1,1,1,1,1,1,1,1,1,1,1,1,1,1,1,"ALL",1,"ALL",1,"ALL",1,"ALL",1,1,1,1,1,1,1,1,1,1,1,1,1,1,1,1,1,1,1,1,1,1,1,1,1,1,1,1,1,1,1,1,"ALL",1,"ALL",1,1,"ALL",1,"ALL",1,1,1,"ALL",1,1,240]
[null,109056966,"Language: Korean","ALL",1,1,1,1,1,1,1,1,1,1,1,1,1,1,1,1,1,1,1,1,1,1,1,1,1,1,1,1,1,1,1,1,1,1,1,1,1,1,1,1,1,1,1,1,1,1,1,1,1,1,1,1,1,1,1,"ALL",1,1,1,1,"ALL",1,1,1,1,1,1,1,1,"ALL",1,1,"ALL",1,1,1,1,"ALL",1,1,1,1,1,"ALL",1,"ALL",1,"ALL",1,"ALL",1,1,1,"ALL",1,1,1,1,"ALL",1,1,1,1,1,"ALL",1,1,1,1,1,1,1,1,1,1,1,1,1,1,1,1,1,1,1,1,1,1,1,1,1,1,1,1,1,1,1,1,1,1,1,1,"ALL",1,"ALL",1,"ALL",1,1,1,1,1,1,1,1,1,1,1,1,1,1,1,1,1,1,1,1,1,"ALL",1,1,1,1,"ALL",1,"ALL",1,1,1,1,1,1,1,1,1,1,1,1,1,1,"ALL",1,1,1,1,"ALL",1,1,1,"ALL",1,1,1,1,1,1,1,1,1,1,1,1,1,1,1,1,1,1,"ALL",1,"ALL",1,"ALL",1,"ALL",1,1,1,1,1,1,1,1,1,1,1,1,1,1,1,1,1,1,1,1,1,1,1,1,1,1,1,1,1,1,1,1,"ALL",1,"ALL",1,1,"ALL",1,"ALL",1,1,1,"ALL",1,1,240]
[null,109056972,"Language: Norwegian (Bokmal)","ALL",1,1,1,1,1,1,1,1,1,1,1,1,1,1,1,1,1,1,1,1,1,1,1,1,1,1,1,1,1,1,1,1,1,1,1,1,1,1,1,1,1,1,1,1,1,1,1,1,1,1,1,1,1,1,1,"ALL",1,1,1,1,"ALL",1,1,1,1,1,1,1,1,"ALL",1,1,"ALL",1,1,1,1,"ALL",1,1,1,1,1,"ALL",1,"ALL",1,"ALL",1,"ALL",1,1,1,"ALL",1,1,1,1,"ALL",1,1,1,1,1,"ALL",1,1,1,1,1,1,1,1,1,1,1,1,1,1,1,1,1,1,1,1,1,1,1,1,1,1,1,1,1,1,1,1,1,1,1,1,"ALL",1,"ALL",1,"ALL",1,1,1,1,1,1,1,1,1,1,1,1,1,1,1,1,1,1,1,1,1,"ALL",1,1,1,1,"ALL",1,"ALL",1,1,1,1,1,1,1,1,1,1,1,1,1,1,"ALL",1,1,1,1,"ALL",1,1,1,"ALL",1,1,1,1,1,1,1,1,1,1,1,1,1,1,1,1,1,1,"ALL",1,"ALL",1,"ALL",1,"ALL",1,1,1,1,1,1,1,1,1,1,1,1,1,1,1,1,1,1,1,1,1,1,1,1,1,1,1,1,1,1,1,1,"ALL",1,"ALL",1,1,"ALL",1,"ALL",1,1,1,"ALL",1,1,240]
[null,109056973,"Language: Polish","ALL",1,1,1,1,1,1,1,1,1,1,1,1,1,1,1,1,1,1,1,1,1,1,1,1,1,1,1,1,1,1,1,1,1,1,1,1,1,1,1,1,1,1,1,1,1,1,1,1,1,1,1,1,1,1,1,"ALL",1,1,1,1,"ALL",1,1,1,1,1,1,1,1,"ALL",1,1,"ALL",1,1,1,1,"ALL",1,1,1,1,1,"ALL",1,"ALL",1,"ALL",1,"ALL",1,1,1,"ALL",1,1,1,1,"ALL",1,1,1,1,1,"ALL",1,1,1,1,1,1,1,1,1,1,1,1,1,1,1,1,1,1,1,1,1,1,1,1,1,1,1,1,1,1,1,1,1,1,1,1,"ALL",1,"ALL",1,"ALL",1,1,1,1,1,1,1,1,1,1,1,1,1,1,1,1,1,1,1,1,1,"ALL",1,1,1,1,"ALL",1,"ALL",1,1,1,1,1,1,1,1,1,1,1,1,1,1,"ALL",1,1,1,1,"ALL",1,1,1,"ALL",1,1,1,1,1,1,1,1,1,1,1,1,1,1,1,1,1,1,"ALL",1,"ALL",1,"ALL",1,"ALL",1,1,1,1,1,1,1,1,1,1,1,1,1,1,1,1,1,1,1,1,1,1,1,1,1,1,1,1,1,1,1,1,"ALL",1,"ALL",1,1,"ALL",1,"ALL",1,1,1,"ALL",1,1,240]
[null,109056974,"Language: Portuguese (Portugal)","ALL",1,1,1,1,1,1,1,1,1,1,1,1,1,1,1,1,1,1,1,1,1,1,1,1,1,1,1,1,1,1,1,1,1,1,1,1,1,1,1,1,1,1,1,1,1,1,1,1,1,1,1,1,1,1,1,"ALL",1,1,1,1,"ALL",1,1,1,1,1,1,1,1,"ALL",1,1,"ALL",1,1,1,1,"ALL",1,1,1,1,1,"ALL",1,"ALL",1,"ALL",1,"ALL",1,1,1,"ALL",1,1,1,1,"ALL",1,1,1,1,1,"ALL",1,1,1,1,1,1,1,1,1,1,1,1,1,1,1,1,1,1,1,1,1,1,1,1,1,1,1,1,1,1,1,1,1,1,1,1,"ALL",1,"ALL",1,"ALL",1,1,1,1,1,1,1,1,1,1,1,1,1,1,1,1,1,1,1,1,1,"ALL",1,1,1,1,"ALL",1,"ALL",1,1,1,1,1,1,1,1,1,1,1,1,1,1,"ALL",1,1,1,1,"ALL",1,1,1,"ALL",1,1,1,1,1,1,1,1,1,1,1,1,1,1,1,1,1,1,"ALL",1,"ALL",1,"ALL",1,"ALL",1,1,1,1,1,1,1,1,1,1,1,1,1,1,1,1,1,1,1,1,1,1,1,1,1,1,1,1,1,1,1,1,"ALL",1,"ALL",1,1,"ALL",1,"ALL",1,1,1,"ALL",1,1,240]
[null,109056975,"Language: Russian","ALL",1,1,1,1,1,1,1,1,1,1,1,1,1,1,1,1,1,1,1,1,1,1,1,1,1,1,1,1,1,1,1,1,1,1,1,1,1,1,1,1,1,1,1,1,1,1,1,1,1,1,1,1,1,1,1,"ALL",1,1,1,1,"ALL",1,1,1,1,1,1,1,1,"ALL",1,1,"ALL",1,1,1,1,"ALL",1,1,1,1,1,"ALL",1,"ALL",1,"ALL",1,"ALL",1,1,1,"ALL",1,1,1,1,"ALL",1,1,1,1,1,"ALL",1,1,1,1,1,1,1,1,1,1,1,1,1,1,1,1,1,1,1,1,1,1,1,1,1,1,1,1,1,1,1,1,1,1,1,1,"ALL",1,"ALL",1,"ALL",1,1,1,1,1,1,1,1,1,1,1,1,1,1,1,1,1,1,1,1,1,"ALL",1,1,1,1,"ALL",1,"ALL",1,1,1,1,1,1,1,1,1,1,1,1,1,1,"ALL",1,1,1,1,"ALL",1,1,1,"ALL",1,1,1,1,1,1,1,1,1,1,1,1,1,1,1,1,1,1,"ALL",1,"ALL",1,"ALL",1,"ALL",1,1,1,1,1,1,1,1,1,1,1,1,1,1,1,1,1,1,1,1,1,1,1,1,1,1,1,1,1,1,1,1,"ALL",1,"ALL",1,1,"ALL",1,"ALL",1,1,1,"ALL",1,1,240]
[null,109056976,"Language: Spanish","ALL",1,1,1,1,1,1,1,1,1,1,1,1,1,1,1,1,1,1,1,1,1,1,1,1,1,1,1,1,1,1,1,1,1,1,1,1,1,1,1,1,1,1,1,1,1,1,1,1,1,1,1,1,1,1,1,"ALL",1,1,1,1,"ALL",1,1,1,1,1,1,1,1,"ALL",1,1,"ALL",1,1,1,1,"ALL",1,1,1,1,1,"ALL",1,"ALL",1,"ALL",1,"ALL",1,1,1,"ALL",1,1,1,1,"ALL",1,1,1,1,1,"ALL",1,1,1,1,1,1,1,1,1,1,1,1,1,1,1,1,1,1,1,1,1,1,1,1,1,1,1,1,1,1,1,1,1,1,1,1,"ALL",1,"ALL",1,"ALL",1,1,1,1,1,1,1,1,1,1,1,1,1,1,1,1,1,1,1,1,1,"ALL",1,1,1,1,"ALL",1,"ALL",1,1,1,1,1,1,1,1,1,1,1,1,1,1,"ALL",1,1,1,1,"ALL",1,1,1,"ALL",1,1,1,1,1,1,1,1,1,1,1,1,1,1,1,1,1,1,"ALL",1,"ALL",1,"ALL",1,"ALL",1,1,1,1,1,1,1,1,1,1,1,1,1,1,1,1,1,1,1,1,1,1,1,1,1,1,1,1,1,1,1,1,"ALL",1,"ALL",1,1,"ALL",1,"ALL",1,1,1,"ALL",1,1,240]
[null,109056977,"Language: Swedish","ALL",1,1,1,1,1,1,1,1,1,1,1,1,1,1,1,1,1,1,1,1,1,1,1,1,1,1,1,1,1,1,1,1,1,1,1,1,1,1,1,1,1,1,1,1,1,1,1,1,1,1,1,1,1,1,1,"ALL",1,1,1,1,"ALL",1,1,1,1,1,1,1,1,"ALL",1,1,"ALL",1,1,1,1,"ALL",1,1,1,1,1,"ALL",1,"ALL",1,"ALL",1,"ALL",1,1,1,"ALL",1,1,1,1,"ALL",1,1,1,1,1,"ALL",1,1,1,1,1,1,1,1,1,1,1,1,1,1,1,1,1,1,1,1,1,1,1,1,1,1,1,1,1,1,1,1,1,1,1,1,"ALL",1,"ALL",1,"ALL",1,1,1,1,1,1,1,1,1,1,1,1,1,1,1,1,1,1,1,1,1,"ALL",1,1,1,1,"ALL",1,"ALL",1,1,1,1,1,1,1,1,1,1,1,1,1,1,"ALL",1,1,1,1,"ALL",1,1,1,"ALL",1,1,1,1,1,1,1,1,1,1,1,1,1,1,1,1,1,1,"ALL",1,"ALL",1,"ALL",1,"ALL",1,1,1,1,1,1,1,1,1,1,1,1,1,1,1,1,1,1,1,1,1,1,1,1,1,1,1,1,1,1,1,1,"ALL",1,"ALL",1,1,"ALL",1,"ALL",1,1,1,"ALL",1,1,240]
[null,109056978,"Language: Turkish","ALL",1,1,1,1,1,1,1,1,1,1,1,1,1,1,1,1,1,1,1,1,1,1,1,1,1,1,1,1,1,1,1,1,1,1,1,1,1,1,1,1,1,1,1,1,1,1,1,1,1,1,1,1,1,1,1,"ALL",1,1,1,1,"ALL",1,1,1,1,1,1,1,1,"ALL",1,1,"ALL",1,1,1,1,"ALL",1,1,1,1,1,"ALL",1,"ALL",1,"ALL",1,"ALL",1,1,1,"ALL",1,1,1,1,"ALL",1,1,1,1,1,"ALL",1,1,1,1,1,1,1,1,1,1,1,1,1,1,1,1,1,1,1,1,1,1,1,1,1,1,1,1,1,1,1,1,1,1,1,1,"ALL",1,"ALL",1,"ALL",1,1,1,1,1,1,1,1,1,1,1,1,1,1,1,1,1,1,1,1,1,"ALL",1,1,1,1,"ALL",1,"ALL",1,1,1,1,1,1,1,1,1,1,1,1,1,1,"ALL",1,1,1,1,"ALL",1,1,1,"ALL",1,1,1,1,1,1,1,1,1,1,1,1,1,1,1,1,1,1,"ALL",1,"ALL",1,"ALL",1,"ALL",1,1,1,1,1,1,1,1,1,1,1,1,1,1,1,1,1,1,1,1,1,1,1,1,1,1,1,1,1,1,1,1,"ALL",1,"ALL",1,1,"ALL",1,"ALL",1,1,1,"ALL",1,1,240]
[null,null,"Business Ready Enhancement Plan","ALL",1,1,1,1,1,1,1,1,1,1,1,1,1,1,1,1,1,1,1,1,1,1,1,1,1,1,1,1,1,1,1,1,1,1,1,1,1,1,1,1,1,1,1,1,1,1,1,1,1,1,1,1,1,1,1,"ALL",1,1,1,1,"ALL",1,1,1,1,1,1,1,1,"ALL",1,1,"ALL",1,1,1,1,"ALL",1,1,1,1,1,"ALL",1,"ALL",1,"ALL",1,"ALL",1,1,1,"ALL",1,1,1,1,"ALL",1,1,1,1,1,"ALL",1,1,1,1,1,1,1,1,1,1,1,1,1,1,1,1,1,1,1,1,1,1,1,1,1,1,1,1,1,1,1,1,1,1,1,1,"ALL",1,"ALL",1,"ALL",1,1,1,1,1,1,1,1,1,1,1,1,1,1,1,1,1,1,1,1,1,"ALL",1,1,1,1,"ALL",1,"ALL",1,1,1,1,1,1,1,1,1,1,1,1,1,1,"ALL",1,1,1,1,"ALL",1,1,1,"ALL",1,1,1,1,1,1,1,1,1,1,1,1,1,1,1,1,1,1,"ALL",1,"ALL",1,"ALL",1,"ALL",1,1,1,1,1,1,1,1,1,1,1,1,1,1,1,1,1,1,1,1,1,1,1,1,1,1,1,1,1,1,1,1,"ALL",1,"ALL",1,1,"ALL",1,"ALL",1,1,1,"ALL",1,1,240]
[null,null,"Three Year Business Ready Enhancement Plan","ALL",1,1,1,1,1,1,1,1,1,1,1,1,1,1,1,1,1,1,1,1,1,1,1,1,1,1,1,1,1,1,1,1,1,1,1,1,1,1,1,1,1,1,1,1,1,1,1,1,1,1,1,1,1,1,1,"ALL",1,1,1,1,"ALL",1,1,1,1,1,1,1,1,"ALL",1,1,"ALL",1,1,1,1,"ALL",1,1,1,1,1,"ALL",1,"ALL",1,"ALL",1,"ALL",1,1,1,"ALL",1,1,1,1,"ALL",1,1,1,1,1,"ALL",1,1,1,1,1,1,1,1,1,1,1,1,1,1,1,1,1,1,1,1,1,1,1,1,1,1,1,1,1,1,1,1,1,1,1,1,"ALL",1,"ALL",1,"ALL",1,1,1,1,1,1,1,1,1,1,1,1,1,1,1,1,1,1,1,1,1,"ALL",1,1,1,1,"ALL",1,"ALL",1,1,1,1,1,1,1,1,1,1,1,1,1,1,"ALL",1,1,1,1,"ALL",1,1,1,"ALL",1,1,1,1,1,1,1,1,1,1,1,1,1,1,1,1,1,1,"ALL",1,"ALL",1,"ALL",1,"ALL",1,1,1,1,1,1,1,1,1,1,1,1,1,1,1,1,1,1,1,1,1,1,1,1,1,1,1,1,1,1,1,1,"ALL",1,"ALL",1,1,"ALL",1,"ALL",1,1,1,"ALL",1,1,240]
[null,null,"Business Ready Advantage Plan","NONE",0,0,0,0,0,0,0,0,0,0,0,0,0,0,0,0,0,0,0,0,0,0,0,0,0,0,0,0,0,0,0,0,0,0,0,0,0,0,0,0,0,0,0,0,0,0,0,0,0,0,0,0,0,0,0,"ALL",1,1,1,1,"NONE",0,0,0,0,0,0,0,0,"ALL",1,1,"NONE",0,0,0,0,"NONE",0,0,0,0,0,"ALL",1,"NONE",0,"ALL",1,"NONE",0,0,0,"NONE",0,0,0,0,"NONE",0,0,0,0,0,"NONE",0,0,0,0,0,0,0,0,0,0,0,0,0,0,0,0,0,0,0,0,0,0,0,0,0,0,0,0,0,0,0,0,0,0,0,0,"NONE",0,"NONE",0,"NONE",1,1,1,1,1,1,1,1,1,1,1,1,1,1,1,1,1,1,1,1,1,"NONE",1,1,1,1,"ALL",1,"NONE",0,0,0,0,0,0,0,0,0,0,0,0,0,0,"NONE",0,0,0,0,"NONE",0,0,0,"NONE",1,1,1,1,1,1,1,1,1,1,1,1,1,1,1,1,1,1,"NONE",0,"NONE",0,"ALL",0,"NONE",0,0,0,0,0,0,0,0,0,0,0,0,0,0,0,0,0,0,0,0,0,0,0,0,0,0,0,0,0,0,0,0,"NONE",0,"NONE",0,0,"NONE",0,"NONE",0,0,0,"ALL",1,1,54]
[null,null,"Business Ready Advantage Plus Plan","NONE",0,0,0,0,0,0,0,0,0,0,0,0,0,0,0,0,0,0,0,0,0,0,0,0,0,0,0,0,0,0,0,0,0,0,0,0,0,0,0,0,0,0,0,0,0,0,0,0,0,0,0,0,0,0,0,"ALL",1,1,1,1,"NONE",0,0,0,0,0,0,0,0,"ALL",1,1,"NONE",0,0,0,0,"NONE",0,0,0,0,0,"NONE",0,"NONE",0,"NONE",0,"NONE",0,0,0,"NONE",0,0,0,0,"NONE",0,0,0,0,0,"NONE",0,0,0,0,0,0,0,0,0,0,0,0,0,0,0,0,0,0,0,0,0,0,0,0,0,0,0,0,0,0,0,0,0,0,0,0,"NONE",0,"NONE",0,"NONE",1,1,1,1,1,1,1,1,1,1,1,1,1,1,1,1,1,1,1,1,1,"NONE",0,0,0,0,"NONE",0,"NONE",0,0,0,0,0,0,0,0,0,0,0,0,0,0,"NONE",0,0,0,0,"NONE",0,0,0,"NONE",0,0,0,0,0,0,0,0,0,0,0,0,0,0,0,0,0,0,"NONE",0,"NONE",0,"NONE",0,"NONE",0,0,0,0,0,0,0,0,0,0,0,0,0,0,0,0,0,0,0,0,0,0,0,0,0,0,0,0,0,0,0,0,"NONE",0,"NONE",0,0,"NONE",0,"NONE",0,0,0,"ALL",1,1,29]
[null,null,"Three Year Business Ready Advantage Plan","NONE",0,0,0,0,0,0,0,0,0,0,0,0,0,0,0,0,0,0,0,0,0,0,0,0,0,0,0,0,0,0,0,0,0,0,0,0,0,0,0,0,0,0,0,0,0,0,0,0,0,0,0,0,0,0,0,"NONE",0,0,0,0,"NONE",0,0,0,0,0,0,0,0,"ALL",1,1,"NONE",0,0,0,0,"NONE",0,0,0,0,0,"NONE",0,"NONE",0,"NONE",0,"NONE",0,0,0,"NONE",0,0,0,0,"NONE",0,0,0,0,0,"NONE",0,0,0,0,0,0,0,0,0,0,0,0,0,0,0,0,0,0,0,0,0,0,0,0,0,0,0,0,0,0,0,0,0,0,0,0,"NONE",0,"NONE",0,"NONE",1,1,1,1,1,1,1,1,1,1,1,1,1,1,1,1,1,1,1,1,1,"NONE",0,0,0,0,"NONE",0,"NONE",0,0,0,0,0,0,0,0,0,0,0,0,0,0,"NONE",0,0,0,0,"NONE",0,0,0,"NONE",0,0,0,0,0,0,0,0,0,0,0,0,0,0,0,0,0,0,"NONE",0,"NONE",0,"NONE",0,"NONE",0,0,0,0,0,0,0,0,0,0,0,0,0,0,0,0,0,0,0,0,0,0,0,0,0,0,0,0,0,0,0,0,"NONE",0,"NONE",0,0,"NONE",0,"NONE",0,0,0,"ALL",1,1,25]